program: Gaussian 09
title: 000140607
version: EM64L-G09RevD.01
frameworkgroup: C1[X(C6H12)]
method: RPBEPBE
basis: SDD
operation: Freq
keyword: #p
keyword: freq=noraman
keyword: PBEPBE/SDD
title: #p freq=noraman PBEPBE/SDD
converged: YES YES NO NO
title: Mulliken charges:
elementType: C C C C C C H H H H H H H H H H H H
charge: -0.104249 -0.115069 -0.551568 -0.389015 -0.717071 -0.687114 0.218072 0.222159 0.224842 0.226621 0.204125 0.188934 0.217295 0.207458 0.216014 0.209550 0.218374 0.210643
chargesum: 0.00000
title: Mulliken charges with hydrogens summed into heavy atoms:
elementType: C C C C C C
charge: 0.113823 0.107090 -0.100105 0.004045 -0.076304 -0.048548
polarizability: 7.13878135e+01 -1.83495079e-01 6.32805488e+01 1.22519285e+00 3.15734411e-01 5.48835762e+01
1716.lowfreq: -18.6407 -4.9722 0.0004 0.0006 0.0007 15.5899 96.5304 151.8104 185.6685
frequency: 96.2932 151.7983 185.6542 209.3454 283.8253 345.8541 390.3485 443.8448 733.7312 773.1682 793.1844 856.9741 870.0587 921.3411 992.3953 995.8579 1029.7927 1068.3679 1076.2306 1100.2455 1108.8806 1174.5250 1184.4737 1212.9010 1257.1648 1299.5756 1329.0106 1385.0850 1391.5205 1409.1563 1461.9624 1468.4212 1471.7203 1474.8407 1478.3372 1484.7042 2965.2378 2966.5937 2974.6005 3012.9302 3056.4789 3059.2122 3069.1471 3073.6425 3080.3270 3087.7633 3096.4977 3185.8157
redmass: 2.0994 2.2523 1.0775 1.2168 1.7925 2.2966 2.3580 2.4149 1.7408 2.1337 1.3132 1.8463 1.3480 1.3017 1.7627 1.5771 1.2665 1.3301 1.7458 1.7294 1.7393 1.8694 1.9389 1.4599 1.2733 1.2479 1.4728 1.2365 1.2149 1.7499 1.3072 1.1109 1.0484 1.0427 1.1112 1.0683 1.0579 1.0367 1.0362 1.1004 1.0993 1.0967 1.0991 1.0997 1.0688 1.0793 1.0901 1.1151
irintensity: 0.0207 0.2800 0.0053 0.0733 0.2018 0.3657 0.4249 0.7383 5.6764 6.0475 8.3494 5.3079 8.2557 7.5002 4.3134 4.9166 19.8485 5.7570 5.1044 5.6945 1.1744 0.4204 0.8966 0.4587 0.4965 3.0696 1.5058 13.0886 9.2557 1.7920 7.0041 8.1149 7.5634 7.9069 10.3854 10.0858 64.6093 26.7694 30.4432 19.4089 39.8043 19.0465 37.1239 54.1748 31.4004 23.3420 51.5782 25.5830
temp: 298.150 k
press: 1.00000 atm
elementType: 6 6 6 6 6 6 1 1 1 1 1 1 1 1 1 1 1 1
symmnumber: 1
zpe: 427897.3 jmol-1
zpe.correction: 0.162977 hartree
zpe.thermalcorrener: 0.170512 hartree
zpe.thermalcorrenthalpy: 0.171456 hartree
zpe.thermalcorrgfe: 0.131873 hartree
zpe.sumelectzpe: -235.300284 hartree
zpe.sumelectthermal: -235.292749 hartree
zpe.sumelectthermalent: -235.291805 hartree
zpe.sumelectthermalfe: -235.331389 hartree
dipole: 0.0568 -0.1296 -0.0078
dipole: 0.1417
quadrupole: -39.5845 -40.1084 -38.2752
quadrupole: 0.5248 -0.6940 -0.2375
quadrupole: -0.2618 -0.7857 1.0475 0.5248 -0.6940 -0.2375
hfenergy: -235.4632613 hartree
pointgroup: C01 [X(C6H12)]
dipole: 0.0233389 0.0505986 0.0016836 debye
dipolederiv: -0.1017529 -0.009378 0.0802202 -0.0455766 0.0993061 0.0143504 0.0963694 0.0420121 0.074321 0.079594 0.0691245 0.0431658 0.0900185 0.0213102 -0.0770403 0.0184328 -0.0869549 0.069233 -0.083411 -0.0885995 0.0503884 -0.0867172 -0.2218638 -0.0176398 0.0217502 -0.0169898 0.0767407 0.1658645 -0.015348 -0.0348159 -0.0093946 0.1081249 0.036685 0.0258728 0.0139027 0.1250957 0.0495925 0.0286899 -0.0456487 0.028837 0.0571288 0.01764 -0.0018957 -0.0078108 0.0437928 -0.0175336 -0.0654083 0.0054433 -0.0515564 -0.0221245 -0.0047911 -0.0296338 -0.0045709 0.0948748 -0.0079951 -0.0053575 -0.005503 0.0048536 0.0754585 0.0853219 0.0025724 0.0633595 -0.1311509 0.0439132 0.0318722 -0.0899742 0.0447265 0.0197801 -0.0390332 -0.0651412 -0.0516362 -0.1239832 0.0757078 0.0428577 -0.0693095 0.0005145 -0.0590609 0.0847843 -0.0326016 0.117582 -0.0048821 -0.0378468 -0.0966827 -0.1020152 -0.0559603 0.0339148 -0.0048152 -0.1096874 -0.0472744 0.0053628 -0.080734 0.0851869 0.0497381 0.0991947 -0.1078608 -0.0885646 0.0598597 -0.1071779 0.0298704 0.0351672 -0.0431406 0.0509209 -0.0322683 0.0247793 0.0673243 -0.0103025 0.0952229 -0.1595326 0.0471824 -0.0758316 -0.0009325 -0.0212713 -0.1934555 0.006923 -0.0167569 0.0150889 0.0956011 0.0716302 0.0128267 -0.020199 -0.0155158 0.0598908 -0.0907389 -0.0774677 -0.0306728 -0.1424234 -0.1712604 0.0530407 0.1063253 0.012597 0.0675474 0.0159311 0.1241487 0.0068456 0.0286842 0.0929696 -0.0128077 -0.0000697 -0.0251861 0.0436462 0.0545725 0.049706 0.0942302 -0.1593521 0.0442402 0.1065076 0.0747631 0.0599512 -0.0747255 -0.080688 0.0590161 -0.0983263 0.0222614 -0.2053279 -0.0175522 -0.0924974 0.0027534 0.0682039 0.0197785 -0.1142414 0.00317 0.0554864 unknown
polarizability: 71.4477986|-0.0298952|63.2902329|-0.7469686|0.0015269|54.813907 unknown
InChI: InChI=1S/C6H12/c1-3-6-4-5(6)2/h5-6H,3-4H2,1-2H3
charge 0 multiplicity 1
18 atoms
C  0.147085 -0.37689 -0.449326
C  -0.998542 0.188076 0.406999
C  -0.987077 -1.304415 0.024054
C  1.553779 -0.515505 0.125399
C  -2.03764 1.126459 -0.191878
C  2.365538 0.797559 0.036728
H  0.11796 -0.094332 -1.511112
H  -0.734642 0.405176 1.450972
H  -0.752741 -2.039754 0.801394
H  -1.723173 -1.647255 -0.710612
H  2.095137 -1.323404 -0.407991
H  1.483824 -0.836738 1.184696
H  -1.683053 2.174829 -0.187272
H  -2.259372 0.852562 -1.240675
H  -2.989335 1.086132 0.371375
H  2.479458 1.121988 -1.014693
H  1.855958 1.611706 0.584751
H  3.378136 0.677105 0.464492
