program: Gaussian 09
title: 000140617
version: EM64L-G09RevD.01
frameworkgroup: C1[X(C4H4N8O14)]
method: RPBEPBE
basis: SDD
operation: Freq
keyword: #p
keyword: freq=noraman
keyword: PBEPBE/SDD
title: #p freq=noraman PBEPBE/SDD
converged: YES YES NO NO
title: Mulliken charges:
elementType: O O O O O O O O O O O O O O N N N N N N N N C C C C H H H H
charge: -0.157577 -0.138542 -0.150397 -0.176206 -0.106673 -0.145075 -0.108137 -0.125518 -0.113786 -0.082954 -0.135326 -0.096488 -0.166763 -0.155039 -0.010083 0.145527 0.088351 0.124027 0.099241 0.125178 0.120770 0.166316 -0.461180 -0.478076 0.339450 0.343821 0.301764 0.319833 0.322698 0.310844
chargesum: 0.00000
title: Mulliken charges with hydrogens summed into heavy atoms:
elementType: O O O O O O O O O O O O O O N N N N N N N N C C C C
charge: -0.157577 -0.138542 -0.150397 -0.176206 -0.106673 -0.145075 -0.108137 -0.125518 -0.113786 -0.082954 -0.135326 -0.096488 -0.166763 -0.155039 -0.010083 0.145527 0.088351 0.124027 0.099241 0.125178 0.120770 0.166316 0.160418 0.155466 0.339450 0.343821
polarizability: 1.99871294e+02 6.48271130e+00 1.51840200e+02 -2.20158250e+00 1.76602752e+00 1.48564104e+02
1716.lowfreq: -8.7465 -4.0750 -2.8608 -0.0002 0.0003 0.0007 25.1330 35.3119 40.1203
frequency: 25.1088 35.3076 40.1140 43.4134 56.4708 66.3865 81.5104 85.4670 90.6860 101.0856 109.1756 115.8241 128.0646 138.5580 146.5258 166.0208 175.9112 186.9266 198.4238 217.1246 223.4653 234.8576 287.6896 305.0957 312.8507 322.7791 342.7238 344.7963 355.1049 384.3639 397.2505 408.7910 487.2561 499.8594 512.6867 529.1552 551.7172 574.4199 606.8472 617.8467 654.5168 666.1390 678.4150 702.4897 711.4107 717.4707 721.1876 742.0511 758.1519 762.1691 765.9917 795.8562 831.4169 846.1900 939.7653 975.8409 1068.4256 1080.8261 1102.8056 1141.1714 1147.8688 1152.5887 1154.5776 1165.3089 1197.7170 1213.4279 1224.2568 1318.2212 1329.3110 1361.1804 1389.4514 1403.2638 1411.8027 1424.0146 1437.0238 1452.9522 1457.4041 1461.3571 1462.8592 1468.0614 2990.3736 3023.9112 3083.9786 3107.0512
redmass: 15.4524 15.7017 14.1159 13.8919 15.6449 14.0534 14.4074 15.5220 14.7614 12.6130 13.8054 12.8729 14.6997 14.7063 14.4054 14.3419 14.1252 14.3041 14.6723 11.7483 12.6047 13.4033 10.9773 6.8953 10.7033 6.7358 13.2699 14.2199 3.6084 12.6898 2.7464 5.5735 11.0522 8.0830 9.9281 10.9828 5.7928 8.0945 6.8275 6.7096 8.0034 8.2877 10.7375 8.7417 12.7036 14.5734 13.9308 6.9374 9.1363 11.4915 10.1928 9.2340 9.0409 9.5959 3.9157 2.4051 10.3048 4.5462 5.7231 13.5927 11.7573 11.6853 14.3053 10.6074 6.4280 12.3077 3.5756 1.5029 1.2014 1.2388 1.2810 1.4592 3.7692 11.7430 1.3165 12.1476 9.7530 6.1153 9.1610 6.6029 1.0638 1.0629 1.0959 1.0990
irintensity: 0.0670 0.1284 0.2407 0.2377 0.2016 0.4647 0.7442 0.7989 0.4053 2.8042 0.3961 2.7293 0.8098 0.5240 1.5115 2.4544 3.9898 5.1078 3.2178 8.8987 2.9066 0.9690 1.5975 0.8973 2.7588 0.4138 1.3424 0.6241 2.4644 0.5824 2.3982 3.0510 9.0462 5.0117 8.1833 4.6964 5.1512 4.3835 1.6746 2.6838 10.5149 1.5033 22.9019 10.8839 15.5328 87.1817 78.1031 65.6479 53.3600 34.3141 19.4322 20.6205 46.7351 40.3549 21.9621 16.1358 11.0391 78.3974 19.8558 159.6371 24.0400 25.6854 105.5024 324.6017 61.3926 5.5895 0.1107 4.4864 8.8200 18.1744 58.0976 8.5055 126.4963 135.1136 85.2040 59.8678 154.0393 147.9496 202.6930 89.9492 1.8938 3.9305 11.8023 6.5466
temp: 298.150 k
press: 1.00000 atm
elementType: 8 8 8 8 8 8 8 8 8 8 8 8 8 8 7 7 7 7 7 7 7 7 6 6 6 6 1 1 1 1
symmnumber: 1
zpe: 394815.0 jmol-1
zpe.correction: 0.150377 hartree
zpe.thermalcorrener: 0.175679 hartree
zpe.thermalcorrenthalpy: 0.176623 hartree
zpe.thermalcorrgfe: 0.093290 hartree
zpe.sumelectzpe: -1643.273603 hartree
zpe.sumelectthermal: -1643.248301 hartree
zpe.sumelectthermalent: -1643.247356 hartree
zpe.sumelectthermalfe: -1643.330690 hartree
dipole: 1.2674 -0.7441 -5.2725
dipole: 5.4735
quadrupole: -169.7059 -165.2105 -149.5081
quadrupole: -1.0295 -0.6843 -2.5483
quadrupole: -8.2310 -3.7357 11.9667 -1.0295 -0.6843 -2.5483
hfenergy: -1643.4239798 hartree
pointgroup: C01 [X(C4H4N8O14)]
dipole: 0.5019839 0.1835657 2.0860722 debye
polarizability: 199.4543282|-7.938163|152.0854842|2.0076149|1.8451154|148.7357856 unknown
InChI: InChI=1S/C4H4N8O14/c13-6(14)3(7(15)16,8(17)18)1-5(12(25)26)2-4(9(19)20,10(21)22)11(23)24/h1-2H2
charge 0 multiplicity 1
30 atoms
O  -3.871018 -1.174441 1.031332
O  -0.952071 -0.252829 -1.797945
O  -2.298317 2.328191 1.54686
O  0.684467 1.93914 0.13034
O  2.081981 -0.815329 -2.013277
O  3.64418 0.608884 2.19415
O  -3.739614 -0.985289 -1.246386
O  -1.816842 1.863398 -1.655651
O  -4.117645 1.80824 0.26769
O  2.340769 1.943629 -1.450421
O  3.670986 -1.652062 -0.586229
O  4.605865 1.009079 0.154737
O  0.949572 -2.901243 0.153636
O  -1.32884 -2.609451 0.17214
N  0.044309 -0.843994 0.749003
N  -3.372391 -0.735843 -0.06077
N  -1.60593 0.682115 -1.220593
N  -2.947372 1.604977 0.718934
N  1.730213 1.460744 -0.448286
N  2.738863 -0.85152 -0.927325
N  3.658116 0.638002 0.91397
N  -0.120625 -2.222015 0.334547
C  -1.173333 -0.178937 1.218085
C  1.378357 -0.476574 1.240224
C  -2.194621 0.304472 0.158821
C  2.318057 0.167952 0.197787
H  -0.866232 0.724794 1.768841
H  -1.749483 -0.83983 1.896286
H  1.896044 -1.378545 1.616084
H  1.278053 0.232384 2.076615
