program: Gaussian 09
title: 000140595
version: EM64L-G09RevD.01
frameworkgroup: C1[X(C6H14O2)]
method: RPBEPBE
basis: SDD
operation: Freq
keyword: #pfreq=noraman
keyword: PBEPBE/SDD
title: #p freq=noraman PBEPBE/SDD
converged: YES YES NO NO
title: Mulliken charges:
elementType: O O C C C C C C H H H H H H H H H H H H H H
charge: -0.467771 -0.474246 0.001848 -0.452054 -0.092989 -0.386094 -0.711283 -0.701132 0.171193 0.216177 0.200666 0.258643 0.212436 0.193080 0.219914 0.200896 0.241651 0.252504 0.209357 0.196623 0.375311 0.335269
chargesum: 0.00000
title: Mulliken charges with hydrogens summed into heavy atoms:
elementType: O O C C C C C C
charge: -0.092459 -0.138977 0.173041 -0.035211 0.165654 0.019422 -0.048821 -0.042648
polarizability: 8.64555285e+01 9.15949647e-01 6.84799327e+01 -2.61180245e-01 3.65253943e-01 6.44365606e+01
1716.lowfreq: -22.4060 -5.7376 -0.0005 0.0006 0.0007 18.1019 57.2591 96.5777 119.2626
frequency: 56.6870 96.2179 119.1765 154.9524 220.4825 222.9773 260.9084 294.9833 310.8638 335.9117 426.7978 441.6487 456.2752 582.8021 675.7017 764.2272 786.7358 817.6886 903.9270 916.4412 940.7208 993.6747 1028.0169 1056.6677 1071.3020 1089.8155 1132.7361 1145.3348 1174.1816 1242.2572 1268.7652 1277.9630 1296.4138 1320.5353 1340.2159 1350.6949 1383.1539 1385.3218 1389.0197 1401.0492 1448.1516 1454.6763 1466.3273 1470.9621 1473.0226 1489.1724 2919.9962 2961.5187 2972.6638 2975.0212 2979.8730 3022.0797 3032.0214 3052.4430 3069.0724 3077.6319 3091.4503 3097.8185 3453.8554 3556.8555
redmass: 2.9481 2.8632 2.7206 2.3103 1.2379 1.0740 2.9880 2.5966 1.4190 2.5452 2.7033 2.3126 2.1182 3.2396 1.0657 1.5312 3.4838 1.8825 2.0802 1.4189 1.9154 1.5801 1.9737 2.5240 1.8573 1.6549 2.6449 2.1029 1.4209 1.2603 1.3026 1.3322 1.1554 1.2971 1.4860 1.2650 1.2288 1.2037 1.2317 1.5097 1.0841 1.0872 1.0520 1.0523 1.0430 1.0546 1.0835 1.0601 1.0390 1.0532 1.0438 1.0993 1.0996 1.0915 1.0992 1.0940 1.0994 1.0995 1.0653 1.0660
irintensity: 0.1965 4.7198 3.8578 1.2618 0.5708 0.3311 0.8373 2.5329 55.2463 49.3266 29.7145 13.3585 3.0025 4.6415 199.1954 2.8118 25.5254 8.2307 5.1254 6.7079 46.3588 35.0939 52.3800 6.6145 9.6808 35.4642 29.6350 35.3230 4.1528 11.9435 5.1734 7.2136 23.6712 11.1253 14.4706 7.3218 9.8152 14.9681 35.0956 29.5129 1.8003 8.9485 15.2122 6.4778 11.1573 13.2051 50.8213 15.0293 20.5321 65.6317 24.0993 15.2317 32.0956 2.4714 59.7218 61.0262 29.2370 30.5634 53.9476 3.7064
temp: 298.150 k
press: 1.00000 atm
elementType: 8 8 6 6 6 6 6 6 1 1 1 1 1 1 1 1 1 1 1 1 1 1
symmnumber: 1
zpe: 509596.4 jmol-1
zpe.correction: 0.194095 hartree
zpe.thermalcorrener: 0.204422 hartree
zpe.thermalcorrenthalpy: 0.205366 hartree
zpe.thermalcorrgfe: 0.158941 hartree
zpe.sumelectzpe: -386.783449 hartree
zpe.sumelectthermal: -386.773123 hartree
zpe.sumelectthermalent: -386.772179 hartree
zpe.sumelectthermalfe: -386.818603 hartree
dipole: -1.7904 -2.2391 1.9929
dipole: 3.4915
quadrupole: -51.2051 -53.4569 -48.6843
quadrupole: 0.3507 -0.1445 2.4751
quadrupole: -0.0897 -2.3414 2.4311 0.3507 -0.1445 2.4751
hfenergy: -386.9775445 hartree
pointgroup: C01 [X(C6H14O2)]
dipole: -0.7321986 0.8702978 -0.7703514 debye
dipolederiv: -0.5965717 0.0743128 0.1311633 0.0537553 -0.7211821 0.151845 0.1394941 0.1688969 -0.494404 -0.7994924 -0.0747563 0.0372521 -0.0420584 -0.6967306 -0.2401082 0.0574413 -0.2749366 -0.2718105 0.4007242 0.0095214 -0.0494144 -0.0091214 0.5131283 -0.1203932 -0.086489 -0.1135815 0.4407911 -0.2867047 0.0094366 0.0281711 -0.0123479 -0.0897366 -0.0095535 0.0997871 0.0171777 0.0886207 0.5109028 0.0409921 -0.0104568 0.0434823 0.5438666 0.1751631 -0.0758852 0.2145551 0.3259272 -0.0028316 -0.0515052 0.0142949 0.0087057 0.0733124 -0.029315 -0.0187106 -0.0456511 0.1435881 -0.1638394 0.1106826 0.0169546 0.03957 -0.0498548 -0.0416154 0.0047949 -0.0207795 0.0927027 -0.0738827 0.0574691 0.013961 0.019588 0.0123468 0.0137765 0.0063503 0.0053942 0.0894825 0.0034906 0.0079112 -0.0069606 0.0073083 -0.0493286 -0.0625288 0.0261101 -0.0317766 -0.2446136 0.061228 -0.0437468 -0.0283885 -0.0139579 -0.0572386 -0.0965231 -0.0004076 -0.125409 -0.0294703 0.0283527 0.0436958 -0.05719 0.0238836 0.0038986 0.078437 -0.0430788 0.1209111 -0.1098007 0.0597866 0.0015852 -0.0397776 -0.0128964 -0.0051848 0.0495568 -0.0125464 0.0211378 -0.08799 0.0252033 0.0127416 0.0394231 0.0198883 0.0545007 -0.063711 0.010144 -0.0965962 -0.1416579 0.0318487 0.0454762 -0.0176977 0.0356112 -0.1273647 0.09949 -0.0058437 0.1312008 0.0104881 0.0941273 -0.013354 -0.0227726 0.0250152 -0.0845656 -0.111513 -0.0011375 -0.1155793 0.0267813 0.0640246 0.0191798 0.0178012 0.0237405 0.0730253 0.0379222 -0.0607674 0.0681985 -0.161498 -0.112692 -0.0670254 0.0544965 -0.1167641 0.0324664 0.0508628 0.0515407 0.0444054 0.0773711 0.1262443 0.0071682 0.0074115 0.0575853 -0.0679396 0.0801079 -0.0167751 0.0942679 0.0419367 -0.1696582 -0.0965866 -0.0343244 -0.1305731 0.0168257 -0.0410438 -0.0503075 -0.0413117 0.080886 0.0694431 0.0107082 -0.0220183 0.0306456 0.0703163 -0.0544726 0.0451401 -0.0686259 -0.184382 0.3610791 -0.1335283 -0.0376541 -0.1252166 0.3156087 -0.0133289 -0.0163464 -0.0233386 0.253623 0.3692177 0.0296218 -0.0342744 0.0741563 0.23983 0.1469451 -0.0525071 0.0714408 0.0534284 unknown
polarizability: 86.4361459|-0.9648664|68.497937|-0.5925593|0.3348608|64.4379389 unknown
InChI: InChI=1S/C6H14O2/c1-3-6(8)4-5(2)7/h5-8H,3-4H2,1-2H3
charge 0 multiplicity 1
22 atoms
O  0.819288 -1.187804 0.684058
O  -1.780493 -1.306706 -0.365794
C  0.80739 -0.050079 -0.251281
C  -0.477026 0.817103 -0.087079
C  -1.711004 -0.001198 0.357284
C  2.088397 0.759058 0.008467
C  -3.032307 0.766688 0.214398
C  3.37342 -0.02063 -0.335734
H  0.834843 -0.442282 -1.29414
H  -0.307248 1.601445 0.678026
H  -0.690506 1.339198 -1.043276
H  -1.571674 -0.322591 1.402658
H  2.094753 1.043691 1.079374
H  2.039623 1.699576 -0.577222
H  -3.014571 1.694524 0.815595
H  -3.21464 1.055864 -0.839484
H  -3.878455 0.146427 0.557682
H  3.397151 -0.971595 0.222741
H  4.277292 0.561354 -0.07781
H  3.419747 -0.256649 -1.416187
H  0.046955 -1.762806 0.423479
H  -1.975234 -1.13539 -1.322255
