program: Gaussian 09
title: 000011384
version: EM64L-G09RevD.01
frameworkgroup: C1[X(C13H10N2)]
method: RPBEPBE
basis: SDD
operation: Freq
keyword: #pfreq=noraman
keyword: PBEPBE/SDD
title: #p freq=noraman PBEPBE/SDD
converged: NO YES NO YES
title: Mulliken charges:
elementType: N N C C C C C C C C C C C C C H H H H H H H H H H
charge: -0.023242 -0.700251 0.504326 0.416557 -0.148329 -0.082249 -0.478600 -0.618702 -0.294550 0.521465 -0.401386 -0.315028 -0.416508 -0.250613 -0.232396 0.246143 0.224871 0.261488 0.231678 0.261030 0.220875 0.225862 0.228366 0.309944 0.309250
chargesum: 0.00000
title: Mulliken charges with hydrogens summed into heavy atoms:
elementType: N N C C C C C C C C C C C C C
charge: -0.023242 -0.081057 0.504326 0.416557 -0.148329 -0.082249 -0.232456 -0.393831 -0.033063 0.521465 -0.169708 -0.053998 -0.195633 -0.024751 -0.004030
polarizability: 3.24662789e+02 -4.00783428e+00 1.52051160e+02 -5.48598981e-03 -3.38745084e-03 5.91328481e+01
1716.lowfreq: -4.9123 -0.0004 -0.0001 0.0007 5.2851 6.0999 74.2643 109.0620 183.6563
frequency: 74.2603 109.0617 183.6563 197.8810 257.0788 327.2549 328.4845 356.2809 371.8632 400.6239 418.9243 445.4050 471.7022 478.1510 500.5869 549.0702 577.3994 612.2029 630.6685 650.1978 728.8456 752.3422 762.1072 768.9675 795.8723 832.6000 835.2067 846.0761 870.5307 893.7216 923.8531 942.5860 967.5876 974.1224 990.3918 1008.5541 1044.5160 1118.0857 1141.5223 1162.7107 1190.7059 1221.2802 1246.6087 1250.8591 1279.2625 1333.9214 1339.9584 1365.9769 1401.5634 1418.6874 1452.8874 1468.5408 1498.4247 1525.3795 1550.6901 1580.5409 1618.8659 1641.6161 1653.1838 3111.3055 3114.5988 3116.6178 3120.2723 3132.2706 3151.0190 3165.0136 3166.6945 3565.9426 3706.2192
redmass: 4.9634 3.8717 4.8998 4.4889 4.2752 3.8334 4.0033 1.1083 5.8623 1.9131 1.6926 3.6362 2.9643 2.7351 7.1810 3.7833 6.7762 7.7491 2.8402 6.0059 6.4574 2.3142 1.4523 5.3003 2.0972 1.8226 4.7174 1.7316 1.6151 5.6699 1.7823 2.8682 1.3834 1.3417 1.3234 2.2301 1.4987 1.6682 1.3222 1.1194 1.2719 1.8587 2.1624 2.7985 1.7819 3.8693 2.7846 2.1481 2.7485 7.8673 3.4355 3.5016 3.9617 6.8414 7.5276 5.7026 6.1699 1.3812 3.5969 1.0913 1.0900 1.0880 1.0891 1.0887 1.0948 1.0959 1.0994 1.0450 1.1040
irintensity: 3.9081 0.5255 0.1782 4.6978 0.1523 1.8621 0.0282 162.5726 0.0873 72.5668 85.7626 1.9195 6.0797 3.4410 0.3162 0.3123 11.8224 2.8746 5.9263 0.0699 0.1874 19.9384 67.5858 0.9081 0.8740 45.0966 8.2130 2.6738 17.0065 0.9469 47.8390 1.8786 8.4033 1.0517 0.0733 7.7609 2.5352 3.3662 24.2170 3.3603 13.7555 1.3302 22.1890 33.5251 0.9831 18.7438 30.3351 0.5688 0.6123 13.3987 26.7818 18.1351 108.0518 15.8064 3.3671 1.4884 52.2330 32.6226 406.9154 13.8965 8.7225 17.7826 23.5006 13.2520 30.0659 18.0669 30.4885 128.4064 22.5438
temp: 298.150 k
press: 1.00000 atm
elementType: 7 7 6 6 6 6 6 6 6 6 6 6 6 6 6 1 1 1 1 1 1 1 1 1 1
symmnumber: 1
zpe: 512539.2 jmol-1
zpe.correction: 0.195216 hartree
zpe.thermalcorrener: 0.206287 hartree
zpe.thermalcorrenthalpy: 0.207231 hartree
zpe.thermalcorrgfe: 0.158782 hartree
zpe.sumelectzpe: -609.892793 hartree
zpe.sumelectthermal: -609.881722 hartree
zpe.sumelectthermalent: -609.880778 hartree
zpe.sumelectthermalfe: -609.929227 hartree
dipole: -3.4262 -2.5196 0.0014
dipole: 4.2529
quadrupole: -54.5716 -78.3734 -94.3047
quadrupole: 1.3342 -0.0076 -0.0017
quadrupole: 21.1783 -2.6235 -18.5548 1.3342 -0.0076 -0.0017
hfenergy: -610.0880087 hartree
pointgroup: C01 [X(C13H10N2)]
dipole: 1.336554 -1.0066303 -0.0005332 debye
dipolederiv: -0.0420098 0.1103261 0.0000075 -0.0176421 -0.2818876 -0.0000008 -0.0000019 -0.0000027 -0.2433297 -1.8441716 0.2731889 -0.0001768 0.7536377 -0.2119445 0.0000212 -0.000776 0.0000739 -0.7369069 0.6184388 -0.1874191 -0.0000065 -0.4287957 -0.2200961 -0.0000115 -0.0000288 -0.0000209 0.1039252 0.0804259 -0.0653808 0.0000007 0.1056108 -0.1605986 -0.0000116 0.0000011 -0.0000053 0.0779335 -0.1149359 -0.1479187 -0.0000181 0.2928521 0.029559 -0.0000104 0.0000092 0.000005 0.0342337 0.0114881 -0.0003458 -0.0000064 -0.1218544 -0.0303986 -0.0000015 -0.0000017 -0.0000061 0.055007 -0.1238962 0.1185725 0.0000013 -0.0672838 0.2308304 0.0000174 -0.0000022 0.0000162 -0.1907942 -0.8704186 0.1897286 -0.0000038 -0.2593349 0.0932313 0.0000217 0.0000619 -0.0000083 -0.2897299 0.2820451 0.1512738 0.0000071 0.0470752 0.1244412 0.0000107 -0.0000097 0.0000164 -0.132353 1.8864765 -0.40247 0.0000806 -0.7071449 0.1176879 -0.0000072 0.0001213 0.0000406 0.1524292 -0.0182249 0.0537288 -0.0000004 0.0914224 0.1223425 0.0000101 -0.000001 0.0000103 -0.1826857 0.127086 0.0137154 -0.0000027 -0.1098219 0.108152 0.000014 -0.0000143 0.0000126 -0.1651711 -0.2615272 0.0384226 0.0000095 0.5510964 0.090328 -0.0000002 0.0000334 0.0000026 -0.2003561 -0.0539904 0.1007278 0.0000016 0.1983132 0.1166509 0.0000076 0.0000046 0.0000082 -0.1601728 -0.1253431 -0.1539884 -0.000009 -0.2244639 -0.0112645 0.0000107 -0.0000098 0.000009 -0.1691584 0.0581709 0.0123535 0.000002 0.0167511 -0.0998013 -0.0000095 0.0000029 -0.0000112 0.1442098 0.0230874 0.0132391 0.0000021 0.0981236 -0.1224664 -0.0000209 0.0000061 -0.0000103 0.1759956 0.0958868 0.0401289 0.0000038 -0.0334481 -0.0558224 -0.000009 0.0000072 -0.0000101 0.1521923 0.0682409 0.0462694 0.000004 -0.0570174 -0.1206692 -0.0000097 -0.0000003 -0.0000118 0.15891 0.0885608 -0.0244265 0.0000007 0.0607545 -0.0621281 -0.0000109 0.0000044 -0.0000088 0.1592954 -0.1227489 -0.1090672 0.0000013 -0.0739669 0.0228885 -0.0000005 -0.0000053 -0.0000046 0.1602842 -0.1061146 -0.1039844 0.0000019 -0.1123774 0.0258855 -0.0000026 0.0000019 -0.0000028 0.1615096 -0.1182767 0.0940339 0.0000098 0.0958421 0.0385798 -0.0000071 0.0000112 -0.0000071 0.1616395 0.2735022 -0.0164868 0.0000608 0.0155149 0.1323364 0.0000425 0.0003603 0.0000364 0.3874248 0.1882487 -0.0442215 0.0000293 -0.1138428 0.124164 -0.0000425 0.0002255 -0.000121 0.385668 unknown
polarizability: 324.7318308|2.0348366|151.9821186|-0.0054469|0.0034499|59.1328481 unknown
InChI: InChI=1S/C13H10N2/c14-11-5-6-13-10(8-11)7-9-3-1-2-4-12(9)15-13/h1-8H,14H2
charge 0 multiplicity 1
25 atoms
N  -0.431258 1.456195 0.000055
N  4.691379 -0.897911 -0.000054
C  0.944851 -0.628464 -0.000053
C  -1.511136 -0.785094 -0.000004
C  0.784123 0.828256 0.0000
C  -1.561813 0.677561 0.000055
C  -0.239942 -1.40881 -0.000056
C  2.260064 -1.194946 -0.000123
C  1.973631 1.641042 0.000003
C  3.399184 -0.37482 -0.000113
C  -2.748777 -1.521131 -0.000005
C  -2.844279 1.329193 0.000112
C  3.233928 1.065683 -0.000044
C  -3.9715 -0.855679 0.000049
C  -4.01988 0.58264 0.000106
H  -0.172587 -2.504391 -0.000101
H  2.368561 -2.287285 -0.000169
H  1.839865 2.727131 0.000052
H  -2.711618 -2.617712 -0.000049
H  -2.852572 2.423737 0.00016
H  4.128854 1.701091 -0.000015
H  -4.90762 -1.4254 0.000049
H  -4.992007 1.088416 0.000147
H  5.501301 -0.285309 -0.000468
H  4.848149 -1.901595 -0.000335
