program: Gaussian 09
title: 000140584
version: EM64L-G09RevD.01
frameworkgroup: C1[X(C12H26O)]
method: RPBEPBE
basis: SDD
operation: Freq
keyword: #pfreq=noraman
keyword: PBEPBE/SDD
title: #p freq=noraman PBEPBE/SDD
converged: NO YES NO NO
title: Mulliken charges:
elementType: O C C C C C C C C C C C C H H H H H H H H H H H H H H H H H H H H H H H H H H
charge: -0.459274 0.014673 -0.445904 -0.435429 -0.433488 -0.405642 -0.387405 -0.025418 -0.344591 -0.718398 -0.375977 -0.698723 -0.702130 0.178872 0.214440 0.183250 0.204917 0.198383 0.181970 0.221748 0.193268 0.203840 0.200204 0.200000 0.166436 0.192178 0.194103 0.207396 0.209100 0.211321 0.214562 0.219911 0.215904 0.209181 0.210185 0.208879 0.251151 0.197669 0.328837
chargesum: 0.00000
title: Mulliken charges with hydrogens summed into heavy atoms:
elementType: O C C C C C C C C C C C C
charge: -0.130437 0.193545 -0.048214 -0.032128 -0.029770 -0.008534 0.012799 0.141018 0.041690 -0.072603 0.040519 -0.063453 -0.044431
polarizability: 1.48946163e+02 -3.15733750e+00 1.32978149e+02 1.82588333e-01 -8.10698535e-01 1.20517898e+02
1716.lowfreq: -8.6082 -7.1427 -0.0009 -0.0007 -0.0007 13.0251 24.4929 29.4210 58.3394
frequency: 22.9578 28.5508 58.2485 63.2514 73.7999 93.3174 110.0245 131.2326 145.2217 172.3561 193.9464 216.6604 224.3740 241.2514 244.0939 264.0228 300.5931 308.7456 326.5588 382.5096 407.0443 439.9658 498.8080 519.9350 545.2410 726.2577 747.5905 761.1870 777.6471 786.0901 808.6025 854.9268 894.5851 898.5556 929.9042 937.9385 972.4165 992.1282 1024.3204 1034.9604 1042.9460 1044.6849 1058.8935 1064.3885 1075.1859 1085.4048 1097.1728 1141.5610 1154.5311 1157.8349 1182.7628 1219.0235 1221.8951 1237.4386 1252.1118 1260.4140 1277.7093 1280.4711 1283.8496 1291.2665 1300.2476 1314.8325 1323.0957 1337.1910 1345.3539 1349.8863 1356.3515 1363.1465 1381.0868 1389.0225 1389.4495 1397.3917 1450.8481 1457.2050 1466.5435 1467.3820 1470.9080 1472.1002 1476.1237 1478.2156 1478.6358 1483.5232 1487.1465 1488.7568 1495.9926 2911.0130 2927.2909 2944.0245 2954.2886 2960.1250 2964.8840 2968.6283 2971.1973 2973.4964 2976.1715 2979.0181 2984.4275 2995.9665 3006.0628 3010.2990 3015.8079 3034.1465 3038.2292 3040.2808 3066.5029 3067.0073 3069.6440 3070.4330 3073.6754 3099.6064 3556.0527
redmass: 3.2096 3.6442 2.6316 1.6367 2.1512 2.5244 2.5360 2.7761 2.2498 1.7676 1.7766 1.4173 1.1496 2.8356 1.3608 2.5887 1.4442 1.6728 2.5621 2.8150 2.6142 2.4239 3.0439 2.5845 2.2104 1.0862 1.3015 1.4004 1.5275 1.4105 1.5867 1.7005 1.6765 1.6719 2.3097 1.5306 1.5638 2.0851 1.8038 2.8590 1.4191 2.2852 1.9693 2.3983 2.1798 1.8084 1.7542 2.3799 2.0956 1.9263 1.6461 1.3706 1.3253 1.3055 1.3205 1.1860 1.2438 1.1465 1.1578 1.0628 1.2285 1.3040 1.3401 1.3980 1.4525 1.4979 1.5575 1.4712 1.3144 1.2161 1.2200 1.5194 1.0799 1.0878 1.0641 1.0680 1.0745 1.0443 1.0434 1.0646 1.0646 1.0695 1.0770 1.0559 1.0714 1.0834 1.0810 1.0644 1.0626 1.0580 1.0604 1.0573 1.0382 1.0448 1.0534 1.0378 1.0595 1.0974 1.0956 1.1008 1.0986 1.1016 1.1014 1.0996 1.0995 1.1004 1.0994 1.0992 1.0995 1.0996 1.0660
irintensity: 0.1941 0.1484 0.3138 0.0026 0.1365 0.2779 0.1725 0.5836 1.1743 0.0476 1.0429 2.2549 0.1968 2.7553 0.0434 0.0279 72.4448 66.6600 15.8306 0.2952 3.2685 8.2917 5.4554 2.3214 5.3677 12.2520 0.0936 2.0396 5.4737 4.4109 0.7928 8.4351 5.1760 6.7116 81.1119 6.9435 3.3182 1.4270 4.6186 3.6000 2.5260 6.6260 2.5951 15.3510 6.2063 4.9256 3.2015 18.2979 8.6828 7.2403 5.7569 0.2709 26.4793 1.0556 1.8222 3.1414 1.8150 0.9624 3.6513 0.8731 0.2979 3.9328 7.4610 7.7583 4.8373 4.2795 1.7337 4.0841 4.6466 15.9179 8.0100 27.8261 3.8090 4.0827 2.8505 1.0472 0.7054 9.9515 13.5775 6.7864 4.9751 23.1870 17.3935 12.2885 5.1096 50.6432 22.3431 26.5799 27.5099 9.1028 4.0997 50.5066 33.2626 45.0796 102.5280 47.2072 17.1590 3.6240 4.0966 4.8020 27.3848 80.0746 67.4041 37.8716 35.3579 108.7007 65.5060 60.4627 61.3088 29.7606 5.2122
temp: 298.150 k
press: 1.00000 atm
elementType: 8 6 6 6 6 6 6 6 6 6 6 6 6 1 1 1 1 1 1 1 1 1 1 1 1 1 1 1 1 1 1 1 1 1 1 1 1 1 1
symmnumber: 1
zpe: 937083.2 jmol-1
zpe.correction: 0.356916 hartree
zpe.thermalcorrener: 0.374688 hartree
zpe.thermalcorrenthalpy: 0.375632 hartree
zpe.thermalcorrgfe: 0.309876 hartree
zpe.sumelectzpe: -546.979383 hartree
zpe.sumelectthermal: -546.961611 hartree
zpe.sumelectthermalent: -546.960667 hartree
zpe.sumelectthermalfe: -547.026423 hartree
dipole: 1.4078 -1.4522 0.1117
dipole: 2.0256
quadrupole: -94.6576 -85.2337 -83.0145
quadrupole: 4.9858 0.4349 -2.5962
quadrupole: -7.0223 2.4016 4.6207 4.9858 0.4349 -2.5962
hfenergy: -547.3362991 hartree
pointgroup: C01 [X(C12H26O1)]
dipole: 0.6019209 0.520506 -0.0434187 debye
polarizability: 149.3736555|1.7025168|132.5578254|-0.3899881|-0.7165258|120.5107283 unknown
InChI: InChI=1S/C12H26O/c1-4-7-8-11(5-2)9-10-12(13)6-3/h11-13H,4-10H2,1-3H3
charge 0 multiplicity 1
39 atoms
O  -3.713828 0.031134 -1.42409
C  1.064771 1.285579 -0.273397
C  -0.362989 1.002661 0.273622
C  1.753457 0.018654 -0.859009
C  -1.347987 0.428301 -0.771466
C  1.913739 1.995694 0.818856
C  2.050296 -1.117583 0.148272
C  -2.826473 0.47735 -0.323215
C  2.711046 -2.343723 -0.523998
C  3.318843 2.439311 0.356678
C  -3.150705 -0.44545 0.863312
C  3.023568 -3.482446 0.470819
C  -4.614169 -0.323746 1.336609
H  0.954243 2.004042 -1.117796
H  -0.294414 0.316994 1.141127
H  -0.776103 1.956216 0.667618
H  1.121936 -0.387247 -1.675191
H  2.705458 0.319532 -1.34181
H  -1.244825 1.01417 -1.711921
H  -1.094899 -0.620541 -1.020524
H  1.351755 2.887414 1.164938
H  2.0082 1.333025 1.702963
H  1.113519 -1.444048 0.644244
H  2.717454 -0.747527 0.953164
H  -3.080616 1.528632 -0.048542
H  3.646216 -2.021941 -1.0268
H  2.043404 -2.722001 -1.325103
H  -2.939616 -1.487004 0.549708
H  -2.463412 -0.207507 1.697828
H  3.257876 3.071872 -0.549537
H  3.826752 3.027013 1.143628
H  3.965304 1.574822 0.119849
H  3.493351 -4.346358 -0.034535
H  3.714531 -3.137398 1.263238
H  2.100731 -3.841027 0.965135
H  -4.828226 -1.031913 2.15794
H  -5.302289 -0.535056 0.501209
H  -4.828741 0.697549 1.705657
H  -3.525658 0.583152 -2.225182
