program: Gaussian 09
title: 000011382
version: EM64L-G09RevD.01
frameworkgroup: C1[X(C18H12N2O2)]
method: RPBEPBE
basis: SDD
operation: Freq
keyword: #p
keyword: freq=noraman
keyword: PBEPBE/SDD
title: #p freq=noraman PBEPBE/SDD
converged: YES YES NO NO
title: Mulliken charges:
elementType: O O N N C C C C C C C C C C C C C C C C C C H H H H H H H H H H H H
charge: -0.418230 -0.418259 -0.103762 -0.103810 0.497940 0.497982 -0.386085 -0.386230 0.239136 0.239297 -0.380391 -0.333346 -0.333394 -0.380414 -0.404008 -0.355189 -0.355147 -0.404011 0.284388 0.284434 -0.209428 -0.209370 0.236999 0.237049 0.234812 0.251474 0.251487 0.234822 0.226801 0.257977 0.257964 0.226801 0.360864 0.360852
chargesum: 0.00000
title: Mulliken charges with hydrogens summed into heavy atoms:
elementType: O O N N C C C C C C C C C C C C C C C C C C
charge: -0.057366 -0.057407 -0.103762 -0.103810 0.497940 0.497982 -0.149087 -0.149180 0.239136 0.239297 -0.145580 -0.081872 -0.081907 -0.145592 -0.177208 -0.097213 -0.097183 -0.177211 0.284388 0.284434 -0.209428 -0.209370
polarizability: 6.07681097e+02 3.34612975e+01 2.33768820e+02 2.23050005e-02 -1.00123234e-01 8.45687727e+01
1716.lowfreq: -4.5890 -0.0005 0.0003 0.0010 1.6351 2.8730 21.4357 29.9352 39.9277
frequency: 21.4357 29.9351 39.9238 51.7082 63.5313 67.5771 125.5179 149.5044 150.2848 150.8794 193.6719 212.9589 230.6694 275.2296 322.3554 330.7165 345.9551 372.7342 384.4481 388.3827 393.3400 401.4585 407.0452 414.2047 417.2328 495.7686 508.9635 510.4096 525.0331 533.1388 602.1862 629.4332 630.9023 698.9499 710.7134 730.1490 731.1594 772.7966 772.8324 803.2337 804.6204 809.1209 824.8492 838.4895 839.3195 873.9690 904.2713 912.5491 949.3981 950.4315 970.6864 970.6954 992.7924 999.0187 999.0385 1111.8982 1113.8019 1144.9068 1146.7893 1188.8948 1189.5110 1204.2108 1227.0400 1257.6885 1263.6329 1275.7999 1313.9509 1328.1811 1352.6816 1377.1005 1406.0876 1406.7327 1438.3806 1438.5456 1496.2874 1502.8495 1572.4428 1578.1081 1594.1630 1603.8112 1621.2586 1626.6323 2026.4441 2032.5933 3116.8380 3116.9081 3134.6689 3134.9607 3141.0133 3141.1171 3168.2409 3168.3255 3206.5368 3206.5907 3577.0080 3577.3085
redmass: 8.0761 3.7357 4.8055 7.0902 7.3020 6.7917 8.4214 6.7556 8.2931 11.3955 7.2919 5.3712 7.1943 6.7351 8.6007 7.5935 8.2228 3.2727 1.3412 1.2384 2.6051 4.1847 4.1783 2.8874 3.0624 8.9685 12.9786 2.5726 2.3280 7.5199 5.6314 7.1868 7.1519 5.8254 7.0594 3.4853 3.5558 6.4799 6.3744 1.3209 1.3281 6.7557 6.6989 1.4786 1.5080 5.3451 1.3762 1.4005 1.4494 1.4640 1.3670 1.3671 5.2729 2.7144 2.7602 1.5347 1.4985 1.3478 1.3357 1.1191 1.1240 2.1427 2.5172 2.2605 2.8439 5.6171 1.5570 1.4411 1.5527 2.7021 2.8741 2.4446 3.5943 3.5323 2.5461 2.7238 6.1096 5.9092 5.5968 5.9737 6.1958 6.4211 13.0190 13.0227 1.0876 1.0876 1.0878 1.0880 1.0961 1.0961 1.0908 1.0908 1.0937 1.0938 1.0660 1.0661
irintensity: 2.2917 2.9545 0.0000 1.1318 2.9374 0.0001 0.0000 3.8600 0.0663 9.4001 0.0000 0.0000 7.7246 0.4328 0.0000 0.0000 1.9121 19.2830 0.0053 275.6822 0.0015 54.5346 0.0001 4.0494 0.0002 66.3329 0.0039 59.0603 0.0000 0.0001 13.7318 1.8506 0.0000 0.0000 1.5847 1.5404 0.0001 25.0729 3.1831 44.1311 0.0017 0.0001 26.4558 73.7127 0.0005 0.0000 52.2713 0.0014 14.0245 0.0102 0.0908 0.0247 21.3035 7.5906 0.2240 0.0011 232.0253 750.9381 0.0634 103.5746 0.0397 0.0000 23.9692 0.0045 176.2754 0.0003 1.2915 0.0000 157.5983 0.0000 7.8098 0.0043 0.0534 4.4707 255.2882 0.0002 0.0014 86.4586 0.0001 71.7247 500.1212 0.0130 0.0010 172.9242 32.0602 6.5344 15.8851 4.0231 18.8041 10.6121 8.5547 3.6118 8.4419 0.1074 251.3499 0.2567
temp: 298.150 k
press: 1.00000 atm
elementType: 8 8 7 7 6 6 6 6 6 6 6 6 6 6 6 6 6 6 6 6 6 6 1 1 1 1 1 1 1 1 1 1 1 1
symmnumber: 1
zpe: 650562.5 jmol-1
zpe.correction: 0.247786 hartree
zpe.thermalcorrener: 0.267305 hartree
zpe.thermalcorrenthalpy: 0.268249 hartree
zpe.thermalcorrgfe: 0.197985 hartree
zpe.sumelectzpe: -951.449439 hartree
zpe.sumelectthermal: -951.429920 hartree
zpe.sumelectthermalent: -951.428976 hartree
zpe.sumelectthermalfe: -951.499240 hartree
dipole: 0.0013 -0.0011 -0.0011
dipole: 0.0021
quadrupole: -78.8557 -136.0188 -133.8652
quadrupole: 34.4508 -0.1129 -0.1854
quadrupole: 37.3908 -19.7722 -17.6186 34.4508 -0.1129 -0.1854
hfenergy: -951.6972256 hartree
pointgroup: C01 [X(C18H12N2O2)]
dipole: -0.0005327 0.0006131 0.0000649 debye
polarizability: 606.2618773|23.8471583|138.4980469|32.858963|72.2103935|181.2587647 unknown
InChI: InChI=1S/C18H12N2O2/c1-19-17(11-13-3-7-15(21)8-4-13)18(20-2)12-14-5-9-16(22)10-6-14/h3-12,21-22H
charge 0 multiplicity 1
34 atoms
O  7.461722 -0.070837 -0.079351
O  -7.459527 0.070638 0.08093
N  0.840976 -0.984275 -1.302628
N  -0.83857 0.981642 1.302893
C  3.232698 0.207085 0.281547
C  -3.230748 -0.20728 -0.28216
C  1.795675 0.36179 0.484653
C  -1.793839 -0.36208 -0.485767
C  0.703698 -0.148702 -0.195149
C  -0.701668 0.147348 0.194508
C  4.0853 0.889941 1.205092
C  -3.86149 0.56003 0.750532
C  3.864031 -0.559577 -0.751289
C  -4.083761 -0.890557 -1.204996
C  5.485134 0.820828 1.116976
C  -5.259028 0.635527 0.848486
C  5.261619 -0.635058 -0.848481
C  -5.483572 -0.821479 -1.1161
C  6.077195 0.052775 0.082844
C  -6.07503 -0.05301 -0.081956
C  0.907152 -1.711137 -2.265079
C  -0.904278 1.707406 2.26622
H  1.531566 1.000898 1.335491
H  -1.530087 -1.000725 -1.337027
H  3.631391 1.485238 2.006471
H  -3.263312 1.101987 1.483801
H  3.266315 -1.100811 -1.485461
H  -3.630314 -1.486204 -2.00636
H  6.110148 1.356891 1.842435
H  -5.739643 1.221528 1.6371
H  5.742625 -1.220557 -1.637241
H  -6.10905 -1.357784 -1.84098
H  7.952326 0.439528 0.612373
H  -7.950453 -0.441004 -0.609625
