program: Gaussian 09
title: 000140552
version: EM64L-G09RevD.01
frameworkgroup: C1[X(C12H22)]
method: RPBEPBE
basis: SDD
operation: Freq
keyword: #p
keyword: freq=noraman
keyword: PBEPBE/SDD
title: #p freq=noraman PBEPBE/SDD
converged: YES YES NO NO
title: Mulliken charges:
elementType: C C C C C C C C C C C C H H H H H H H H H H H H H H H H H H H H H H
charge: -0.025050 -0.028909 -0.362412 -0.389162 -0.497001 -0.493705 -0.718163 -0.710484 -0.713131 -0.712693 -0.006807 -0.066748 0.224850 0.203913 0.203086 0.191169 0.210781 0.210118 0.231085 0.228778 0.238791 0.239588 0.211395 0.202161 0.224974 0.201869 0.213112 0.212369 0.212823 0.210400 0.215052 0.215260 0.209947 0.212740
chargesum: 0.00000
title: Mulliken charges with hydrogens summed into heavy atoms:
elementType: C C C C C C C C C C C C
charge: 0.199800 0.175005 0.031843 0.031737 -0.037138 -0.015327 -0.079632 -0.083133 -0.074855 -0.074745 -0.006807 -0.066748
polarizability: 1.67125638e+02 -5.26331436e+00 1.14526970e+02 7.23630792e-01 3.78392057e-01 1.08962956e+02
1716.lowfreq: -20.9495 -17.3157 -0.0002 0.0004 0.0007 6.4251 11.1218 29.5251 35.2653
frequency: -15.1381 29.5076 34.5148 49.9947 96.1328 99.9651 139.3767 192.2403 211.3142 216.0453 236.2093 244.9900 250.7309 264.5483 311.3848 350.1589 357.7141 362.2178 385.4585 409.5422 448.0445 506.7671 559.6890 731.0530 751.5018 752.7778 790.6825 873.4151 895.9692 910.4742 915.8902 945.4755 948.2062 950.8236 973.8526 978.1038 982.5382 1013.8543 1109.7711 1116.2763 1119.5540 1125.4939 1157.9876 1178.0052 1192.2142 1198.3896 1204.5784 1237.5282 1257.1793 1279.7841 1300.0794 1317.1056 1321.8443 1333.1636 1339.0019 1348.7523 1352.0622 1374.9285 1376.9803 1392.7696 1393.7856 1455.9466 1456.2178 1460.4786 1466.2971 1469.6015 1470.8608 1474.2775 1477.0595 1482.8913 1485.6614 1490.1187 1491.1174 2273.1601 2956.8531 2961.4151 2964.3293 2967.1354 2967.5475 2970.5220 2973.6262 2974.3095 2977.0017 2983.9549 3012.4364 3013.0406 3033.3156 3044.1336 3055.5954 3059.5129 3063.9029 3066.3342 3067.4857 3068.8222 3070.2840 3072.3133
redmass: 2.4950 3.3378 3.0556 2.9297 3.4249 1.9678 2.5093 2.8543 1.1736 1.1211 1.5643 1.4008 1.4227 1.7772 2.9228 2.2896 2.2851 2.3308 2.5259 2.0485 3.8856 2.5581 3.1780 2.7506 2.0654 1.2927 3.1530 1.6102 2.0735 1.2081 1.1867 1.2975 2.1316 1.4224 1.8500 1.8488 1.9726 2.1120 1.5875 1.6765 1.7771 2.0584 2.3315 1.8366 1.8991 1.3555 1.2970 1.4142 1.4873 1.1182 1.2153 1.4626 1.6139 1.4650 1.3878 1.4860 1.3798 1.2150 1.2130 1.2152 1.2168 1.0759 1.0722 1.0772 1.0461 1.0588 1.0901 1.0515 1.0545 1.0577 1.0501 1.0540 1.0496 11.6874 1.0790 1.0582 1.0387 1.0379 1.0403 1.0464 1.0661 1.0461 1.0702 1.0630 1.0999 1.0995 1.1014 1.1038 1.0990 1.0995 1.0987 1.1000 1.0994 1.0985 1.0991 1.0987
irintensity: 0.0272 0.1103 0.1435 0.0512 0.8363 0.1928 2.6224 1.8689 2.5114 0.0309 1.0348 1.1289 0.4253 3.8474 2.7973 0.3334 0.1884 0.5332 0.4238 2.1066 3.9015 2.7951 3.0786 2.7864 1.4858 5.2239 2.2418 5.1263 0.9437 2.0263 3.9733 0.3502 0.0593 0.4641 0.3617 2.9041 8.2048 2.2608 0.2276 2.4362 0.5751 1.7402 4.7465 6.5384 5.6322 2.3029 1.5247 0.5473 7.6766 0.5834 0.4232 4.9144 13.1417 2.1210 1.9354 7.7775 0.4081 19.3349 23.1342 24.8570 12.4337 3.4298 3.5972 8.3932 1.4148 4.8429 4.3501 11.7156 3.2201 8.8055 17.0241 18.0761 17.2898 1.2346 15.7580 6.7453 55.9885 24.1469 28.4263 13.0308 23.8258 53.6783 51.5564 47.0141 18.0366 1.1909 43.7307 44.5320 11.3250 13.8962 82.2946 27.8852 46.5259 104.7009 67.0527 58.8682
temp: 298.150 k
press: 1.00000 atm
elementType: 6 6 6 6 6 6 6 6 6 6 6 6 1 1 1 1 1 1 1 1 1 1 1 1 1 1 1 1 1 1 1 1 1 1
symmnumber: 1
zpe: 804344.9 jmol-1
zpe.correction: 0.306359 hartree
zpe.thermalcorrener: 0.321540 hartree
zpe.thermalcorrenthalpy: 0.322484 hartree
zpe.thermalcorrgfe: 0.263275 hartree
zpe.sumelectzpe: -469.436776 hartree
zpe.sumelectthermal: -469.421595 hartree
zpe.sumelectthermalent: -469.420650 hartree
zpe.sumelectthermalfe: -469.479860 hartree
dipole: 0.2739 -0.3936 -0.0278
dipole: 0.4803
quadrupole: -71.2679 -77.6115 -78.0914
quadrupole: -2.2882 0.1205 -0.2537
quadrupole: 4.3890 -1.9545 -2.4345 -2.2882 0.1205 -0.2537
hfenergy: -469.7431347 hartree
pointgroup: C01 [X(C12H22)]
dipole: -0.1092831 -0.1528387 0.0201833 debye
polarizability: 167.2062141|4.8357809|114.3634068|0.8319496|-0.7041911|109.0459438 unknown
InChI: InChI=1S/C12H22/c1-11(2)9-7-5-6-8-10-12(3)4/h11-12H,7-10H2,1-4H3
charge 0 multiplicity 1
34 atoms
C  3.019545 -0.835475 0.045236
C  -3.649397 -0.899707 -0.064302
C  3.169573 0.583174 0.653645
C  -2.130509 -0.567577 -0.086384
C  2.327237 1.6912 -0.044432
C  -1.794137 0.948639 0.024828
C  3.489623 -0.891874 -1.427938
C  3.792437 -1.8651 0.903225
C  -4.3233 -0.489552 1.268511
C  -4.403809 -0.298532 -1.27579
C  0.873205 1.432651 -0.025198
C  -0.343617 1.216024 -0.002944
H  1.941155 -1.096053 0.072944
H  -3.722388 -2.005405 -0.14534
H  2.883875 0.546482 1.72352
H  4.2376 0.883842 0.613998
H  -1.685093 -0.95566 -1.023569
H  -1.629057 -1.097925 0.747177
H  2.66577 1.809739 -1.09284
H  2.530649 2.66004 0.454626
H  -2.280955 1.498426 -0.804675
H  -2.220152 1.355416 0.963066
H  3.40051 -1.918909 -1.828491
H  4.551641 -0.587756 -1.513335
H  2.889204 -0.229398 -2.077367
H  4.87647 -1.63682 0.909136
H  3.440136 -1.859961 1.951989
H  3.667256 -2.889985 0.506635
H  -5.36661 -0.854052 1.309448
H  -4.353547 0.610272 1.385666
H  -3.78136 -0.908851 2.137104
H  -3.923804 -0.585677 -2.230234
H  -4.431944 0.806463 -1.228456
H  -5.45101 -0.653396 -1.301158
