program: Gaussian 09
title: 000140541
version: EM64L-G09RevD.01
frameworkgroup: C1[X(C12H10)]
method: RPBEPBE
basis: SDD
operation: Freq
keyword: #p
keyword: freq=noraman
keyword: PBEPBE/SDD
title: #p freq=noraman PBEPBE/SDD
converged: YES YES NO NO
title: Mulliken charges:
elementType: C C C C C C C C C C C C H H H H H H H H H H
charge: 0.129074 0.129073 -0.262066 -0.262065 -0.270073 -0.269990 -0.269992 -0.270074 -0.228008 -0.228034 -0.228032 -0.228007 0.250411 0.250411 0.223902 0.223896 0.223896 0.223902 0.215445 0.215444 0.215443 0.215444
chargesum: 0.00000
title: Mulliken charges with hydrogens summed into heavy atoms:
elementType: C C C C C C C C C C C C
charge: 0.129074 0.129073 -0.011655 -0.011654 -0.046171 -0.046094 -0.046096 -0.046172 -0.012563 -0.012591 -0.012589 -0.012563
polarizability: 1.28882806e+02 -4.55021827e-03 1.26715172e+02 8.10499305e-04 2.74778385e-03 8.45983051e+01
1716.lowfreq: -16.1714 -13.2426 -12.3970 0.0006 0.0006 0.0007 108.7730 125.3323 189.2421
frequency: 108.7449 125.3323 189.2420 243.5216 319.9874 348.9145 398.1060 418.5937 480.4710 486.2978 567.1645 571.7413 593.4494 593.8949 651.6405 671.5112 723.6407 768.2490 779.9120 794.4862 812.1284 868.5525 895.1321 938.6826 954.3812 959.4417 965.0863 973.4327 975.0848 1002.1328 1014.5308 1033.3616 1088.1625 1102.0854 1134.5423 1150.0076 1182.6835 1184.0748 1218.6956 1237.0433 1270.7459 1351.3121 1369.2634 1403.0382 1408.5821 1549.2956 1590.2307 1604.7761 1645.6070 1645.9294 3092.6942 3095.1860 3095.6584 3099.6497 3124.5094 3125.6870 3135.9074 3144.0442 3145.7879 3177.0433
redmass: 2.9992 4.4075 3.4523 2.8751 3.5921 2.3966 3.5133 2.1571 6.0793 3.7023 3.7456 5.1114 3.8383 3.3768 4.3427 1.2471 1.7072 1.4816 1.3824 1.4719 4.3068 4.6667 1.4673 2.6917 1.3550 1.3963 2.6694 1.3119 1.4144 3.3831 2.9545 1.2322 3.0396 2.8214 2.8993 1.6373 1.1658 1.0257 1.3824 1.6698 2.0146 1.3536 1.5756 1.8504 1.7265 5.9220 9.8924 9.1681 6.1388 5.8921 1.0842 1.0867 1.0843 1.0861 1.0953 1.0954 1.0850 1.0996 1.0996 1.1173
irintensity: 0.0000 0.1666 1.7504 0.8078 0.0000 3.2810 4.5920 22.4914 1.1319 0.0000 1.1969 1.4648 17.9073 0.0352 0.1709 0.3058 147.2004 149.5461 0.0000 0.0002 4.4786 0.0000 0.0000 6.7180 1.0468 0.6647 15.9747 0.0000 0.9170 0.0564 8.2712 5.5865 1.8391 3.8796 0.0000 1.3502 0.0000 1.7500 26.5538 0.5970 0.0259 6.0751 0.0000 2.6830 0.0011 0.7798 2.3181 2.2203 0.0000 0.7155 0.0000 0.5382 13.5525 0.2157 0.0001 79.3227 12.6778 76.6187 11.3622 27.0346
temp: 298.150 k
press: 1.00000 atm
elementType: 6 6 6 6 6 6 6 6 6 6 6 6 1 1 1 1 1 1 1 1 1 1
symmnumber: 1
zpe: 458164.3 jmol-1
zpe.correction: 0.174506 hartree
zpe.thermalcorrener: 0.183719 hartree
zpe.thermalcorrenthalpy: 0.184663 hartree
zpe.thermalcorrgfe: 0.140727 hartree
zpe.sumelectzpe: -462.328220 hartree
zpe.sumelectthermal: -462.319007 hartree
zpe.sumelectthermalent: -462.318063 hartree
zpe.sumelectthermalfe: -462.361999 hartree
dipole: 0.0000 0.0000 0.2124
dipole: 0.2124
quadrupole: -66.3659 -61.3489 -72.1988
quadrupole: -0.0007 0.0001 0.0007
quadrupole: 0.2720 5.2889 -5.5609 -0.0007 0.0001 0.0007
hfenergy: -462.5027259 hartree
pointgroup: C01 [X(C12H10)]
dipole: -0.0000029 -0.0000049 -0.0835638 debye
dipolederiv: 0.1032077 -0.0001024 -0.0000295 -0.0000583 -0.1661401 0.0203504 0.0001431 -0.0480215 0.0621154 0.1032069 -0.0001017 0.0000306 -0.0000561 -0.1661366 -0.0203202 -0.0001401 0.0480511 0.0621131 -0.3581343 0.000113 0.0000881 0.0002037 0.1095355 0.0069087 -0.0000119 0.2081413 0.1170037 -0.3581329 0.0001146 -0.0001006 0.0002004 0.1095096 -0.0069092 0.0000004 -0.2081399 0.1170305 0.0343649 -0.0344819 0.1421485 -0.0515813 0.0467931 -0.0472025 0.1473414 -0.0046311 -0.1870493 0.0343788 0.0344078 -0.1422444 0.0516 0.046853 -0.0470931 -0.1473518 -0.0043407 -0.1869707 0.0343736 0.0344252 0.1422475 0.0516164 0.0468582 0.0470621 0.1473484 0.0043145 -0.1869715 0.034371 -0.0345018 -0.1421375 -0.0516019 0.0467977 0.0471726 -0.1473293 0.0045983 -0.1870644 -0.0053949 -0.1617559 0.0544161 -0.0747959 0.0754109 -0.0322968 0.0510597 -0.0357757 -0.1507443 -0.0053398 0.1618454 -0.0544039 0.0747898 0.0751799 -0.0323312 -0.0509528 -0.0358668 -0.1508565 -0.0053399 0.1618516 0.0543878 0.0747965 0.0751884 0.0323047 0.0509461 0.0358423 -0.1508624 -0.0053878 -0.1617652 -0.0543894 -0.0748045 0.07542 0.0322644 -0.0510433 0.0357396 -0.1507582 0.2417196 -0.0000075 -0.0000357 -0.000139 0.0169016 -0.1205721 -0.0000909 -0.0890165 -0.050858 0.2417193 -0.000008 0.000042 -0.0001414 0.0169278 0.1205644 0.0000986 0.0890072 -0.0508829 0.0630468 -0.0294336 -0.0346786 0.0330241 -0.1277387 0.0323401 -0.0349886 0.0199004 0.1345765 0.0630639 0.0293646 0.0346992 -0.0330883 -0.1277821 0.0323361 0.0349809 0.019826 0.1345606 0.0630652 0.0293611 -0.0347051 -0.0330925 -0.1277875 -0.0323018 -0.034978 -0.0197924 0.1345659 0.0630447 -0.0294278 0.0346805 0.0330293 -0.1277444 -0.0323063 0.0349823 -0.0198669 0.1345854 -0.0854094 0.1007121 -0.0911587 0.0804655 0.025469 0.0319694 -0.0949893 0.0330667 0.1390969 -0.0855041 -0.1006618 0.0911748 -0.0804171 0.0255167 0.0319618 0.0949424 0.0330613 0.1391278 -0.0855009 -0.1006733 -0.0911695 -0.0804292 0.025508 -0.0319491 -0.0949382 -0.0330491 0.1391308 -0.0854182 0.1007257 0.091138 0.0804797 0.02546 -0.0319523 0.0949708 -0.0330482 0.1391117 unknown
polarizability: 128.882808|0.0041639|126.7151705|0.00081|-0.0027479|84.5983051 unknown
InChI: InChI=1S/C12H10/c1-2-6-12-8-4-3-7-11(12,5-1)9-10-12/h1-10H
charge 0 multiplicity 1
22 atoms
C  -0.000108 -0.819309 -0.22129
C  0.000117 0.819296 -0.221395
C  -0.000511 -0.684497 -1.765318
C  0.00056 0.684289 -1.765404
C  1.264512 -1.463728 0.305601
C  -1.264868 -1.463242 0.305826
C  1.264867 1.463299 0.305668
C  -1.264519 1.463782 0.305381
C  2.362254 -0.735226 0.672766
C  -2.362423 -0.734398 0.672877
C  2.362404 0.734497 0.672856
C  -2.362274 0.735325 0.672596
H  -0.000959 -1.44753 -2.54942
H  0.001023 1.447224 -2.549601
H  1.271364 -2.560318 0.381766
H  -1.272075 -2.559832 0.381932
H  1.272072 2.559899 0.381628
H  -1.271373 2.560381 0.381409
H  3.265782 -1.250536 1.021443
H  -3.266115 -1.249433 1.021533
H  3.266086 1.249577 1.021472
H  -3.265816 1.250681 1.021172
