program: Gaussian 09
title: 000011378
version: EM64L-G09RevD.01
frameworkgroup: C1[X(C9H7NO)]
method: RPBEPBE
basis: SDD
operation: Freq
keyword: #pfreq=noraman
keyword: PBEPBE/SDD
title: #p freq=noraman PBEPBE/SDD
converged: NO YES NO YES
title: Mulliken charges:
elementType: O N C C C C C C C C C H H H H H H H
charge: -0.282494 -0.393040 0.327035 0.390274 -0.546211 -0.352090 -0.326066 0.155359 -0.344273 -0.224493 -0.195381 0.242961 0.229877 0.328191 0.251351 0.250740 0.251265 0.236993
chargesum: 0.00000
title: Mulliken charges with hydrogens summed into heavy atoms:
elementType: O N C C C C C C C C C
charge: -0.282494 -0.064848 0.327035 0.390274 -0.303250 -0.122212 -0.074715 0.155359 -0.093533 0.026772 0.041612
polarizability: 2.00947805e+02 -2.72221843e+00 1.08003365e+02 -1.22638919e-02 -1.09813826e-04 4.16588425e+01
1716.lowfreq: -9.7512 -1.5156 -0.0005 0.0005 0.0009 7.8747 103.6686 181.9120 235.2696
frequency: 103.6672 181.9115 235.2686 297.8964 377.1253 419.7506 438.1969 462.5420 520.9668 535.1915 596.8062 650.3098 705.7288 708.6301 745.8737 746.4927 771.4300 824.9759 858.4706 894.7483 917.6558 921.0456 945.9933 981.3510 1041.9541 1096.2224 1128.2634 1172.6076 1232.6117 1243.2348 1275.7611 1297.0333 1384.0066 1404.1887 1434.2176 1472.2901 1516.3715 1527.8921 1588.0021 1593.5316 1643.4667 3116.4786 3130.1720 3141.4884 3154.9548 3175.0957 3199.7528 3532.0736
redmass: 6.4251 3.8638 4.8310 5.9794 3.4329 7.4579 2.5525 6.3881 5.8506 2.9210 6.9500 2.4412 6.9935 1.4549 4.8546 1.9103 1.4714 1.5396 1.9142 3.3145 1.3630 5.1321 1.3697 1.3426 2.4530 1.9043 1.3842 1.3574 1.3442 1.5107 3.0192 1.7268 1.8308 2.7886 3.1281 3.2999 4.9575 6.2575 4.4884 4.0476 6.8899 1.0883 1.0917 1.0911 1.0969 1.0896 1.1004 1.0776
irintensity: 3.3389 6.1813 1.2723 1.7454 0.3878 11.2334 29.3785 3.6026 4.2524 5.9394 0.8227 0.0639 0.1523 104.0467 12.5506 1.0183 32.1973 5.2311 88.7909 1.6098 13.2568 2.7578 2.6540 0.1853 20.8021 10.8678 18.5155 7.2191 4.3547 7.0930 0.9990 36.8451 3.6797 12.8861 27.5400 30.1200 109.1633 91.4551 15.6682 199.0477 165.8198 8.5748 7.2338 9.3976 15.0263 0.9716 7.2739 48.1711
temp: 298.150 k
press: 1.00000 atm
elementType: 8 7 6 6 6 6 6 6 6 6 6 1 1 1 1 1 1 1
symmnumber: 1
zpe: 360935.5 jmol-1
zpe.correction: 0.137473 hartree
zpe.thermalcorrener: 0.145476 hartree
zpe.thermalcorrenthalpy: 0.146420 hartree
zpe.thermalcorrgfe: 0.104650 hartree
zpe.sumelectzpe: -476.366763 hartree
zpe.sumelectthermal: -476.358760 hartree
zpe.sumelectthermalent: -476.357816 hartree
zpe.sumelectthermalfe: -476.399585 hartree
dipole: -8.2035 -0.0501 0.0006
dipole: 8.2036
quadrupole: -74.0377 -49.6202 -67.9721
quadrupole: 10.0275 0.0003 -0.0007
quadrupole: -10.1611 14.2565 -4.0954 10.0275 0.0003 -0.0007
hfenergy: -476.5042358 hartree
pointgroup: C01 [X(C9H7N1O1)]
dipole: 3.2274403 -0.0273403 0.0002273 debye
dipolederiv: -1.3264495 0.1734743 -0.0000756 0.3937969 -0.4767577 0.0000318 -0.0000428 0.0000086 -0.3858772 -0.3444913 0.5229598 -0.0000052 -0.446381 -0.2724545 -0.0000351 -0.0000207 0.0000442 -0.2286133 1.0580914 -0.2385224 0.0000804 -0.3805358 0.0642045 -0.0000326 0.0000834 -0.0000152 0.0729592 -0.4196617 0.0587287 -0.0000361 0.4449087 -0.166317 0.0000407 -0.0000277 0.0000049 0.0540277 -0.9560519 0.1043556 -0.0000481 -0.1229265 -0.0073777 -0.0000075 -0.0000598 0.000013 -0.2912282 0.1931061 0.0440088 0.000029 0.0215691 0.1345123 -0.0000072 0.0000292 -0.0000027 -0.1633262 0.6966756 0.027375 0.0000618 0.2695597 0.2522919 0.0000251 0.0000369 0.0000097 -0.1053284 1.317965 -0.2191256 0.0000819 -0.267393 0.4258374 -0.0000161 0.0000705 -0.0000131 0.1379721 -0.0142638 0.098237 0.0000106 0.4181943 -0.1050236 0.0000325 0.0000033 0.0000039 -0.1280077 -0.2004942 -0.527311 -0.0000155 0.3325827 0.5098499 0.0000232 -0.0000164 -0.000051 -0.0598746 -0.3082178 -0.0185934 -0.000005 -0.6667791 -0.3945883 -0.0000545 0.0000083 -0.0000037 -0.2368163 0.0598488 -0.0267632 -0.0000101 0.0027957 -0.0958718 -0.0000031 -0.0000029 -0.0000097 0.1868479 0.0687999 0.0753627 -0.0000064 -0.0095821 -0.1128657 0.0000017 -0.0000087 0.0000136 0.1502792 0.1410045 0.0527292 -0.0000151 0.0728947 0.2004271 0.000006 -0.0000158 0.0000043 0.3229991 0.1018401 -0.0090429 -0.000003 0.0308017 -0.0831062 0.0000005 0.0000023 -0.0000078 0.1514837 -0.0148356 -0.0961878 -0.0000112 -0.0551314 0.0173096 -0.0000048 -0.0000088 -0.0000045 0.1513775 0.0174869 -0.0571068 -0.0000116 -0.0775407 0.022926 -0.0000044 -0.0000074 -0.0000001 0.1841342 -0.0703527 0.0354219 -0.000021 0.039166 0.0870038 0.0000041 -0.000023 0.0000056 0.1869913 unknown
polarizability: 200.8486564|-4.07627|108.102514|0.0122642|-0.000069|41.6588425 unknown
InChI: InChI=1S/C9H7NO/c11-8-4-3-7-2-1-5-10-9(7)6-8/h1-6,10H
charge 0 multiplicity 1
18 atoms
O  -3.43532 0.817518 -0.000243
N  1.39206 1.430868 0.000095
C  0.227423 0.628697 -0.000004
C  0.451965 -0.820699 0.000027
C  -1.045763 1.184971 -0.000102
C  -0.724478 -1.663834 -0.00009
C  1.761883 -1.322466 0.000134
C  -2.238772 0.343062 -0.00021
C  -1.992402 -1.121897 -0.000183
C  2.674583 0.928531 0.000196
C  2.891695 -0.446795 0.000215
H  -1.202166 2.270936 -0.000093
H  -0.577947 -2.751421 -0.000064
H  1.254445 2.444667 0.000083
H  1.917999 -2.407207 0.000128
H  -2.885924 -1.757489 -0.000234
H  3.485276 1.661134 0.000247
H  3.912643 -0.832977 0.000298
