program: Gaussian 09
title: 000140516
version: EM64L-G09RevD.01
frameworkgroup: C1[X(C3H6F4N2)]
method: RPBEPBE
basis: SDD
operation: Freq
keyword: #pfreq=noraman
keyword: PBEPBE/SDD
title: #p freq=noraman PBEPBE/SDD
converged: NO YES NO NO
title: Mulliken charges:
elementType: F F F F N N C C C H H H H H H
charge: -0.175398 -0.158330 -0.158379 -0.175384 0.147161 0.147122 0.228489 -0.689174 -0.689196 0.247759 0.249614 0.264177 0.264143 0.247867 0.249529
chargesum: 0.00000
title: Mulliken charges with hydrogens summed into heavy atoms:
elementType: F F F F N N C C C
charge: -0.175398 -0.158330 -0.158379 -0.175384 0.147161 0.147122 0.228489 0.072376 0.072343
polarizability: 6.06926130e+01 -6.64459687e-03 5.47463726e+01 -2.36339252e-01 2.28047375e-03 5.34679339e+01
1716.lowfreq: -15.3761 -8.9837 -7.0880 -0.0008 -0.0007 0.0006 70.5470 96.5681 161.7149
frequency: 70.5290 96.5306 161.7126 172.5467 191.4924 251.7965 262.0277 292.6693 295.7689 333.9644 384.0845 442.7009 443.4779 480.4631 623.1731 709.4784 730.2847 772.5790 813.7428 879.8279 894.6342 919.5063 954.1965 1006.3147 1149.7099 1185.8369 1244.8959 1386.6445 1402.8424 1453.7074 1464.2579 1469.3216 1483.4473 3021.1219 3021.9426 3124.0981 3126.0164 3131.0104 3131.0658
redmass: 8.1809 8.4464 4.1956 1.2813 1.0880 4.9953 3.3436 8.0969 3.8585 3.2323 7.3089 7.8972 6.7027 7.0387 3.5534 5.6137 5.9584 10.5809 11.1379 12.9350 13.8039 2.7688 1.3960 1.3174 1.9233 2.1495 5.1421 1.1920 1.1881 1.0452 1.0452 1.0503 1.0478 1.0351 1.0355 1.1004 1.1000 1.1008 1.1011
irintensity: 0.1040 1.9177 3.2758 0.5362 0.2163 0.5380 1.7870 0.9304 4.2341 3.1406 7.6815 5.2598 2.6656 8.2177 10.3028 3.7610 0.0017 122.2297 87.0090 98.9367 0.0568 10.2467 1.3368 0.0860 30.6572 11.6741 8.9255 37.0020 21.5674 10.0503 1.2955 12.1295 28.5255 2.1463 3.3180 0.4360 3.8630 3.8010 4.0706
temp: 298.150 k
press: 1.00000 atm
elementType: 9 9 9 9 7 7 6 6 6 1 1 1 1 1 1
symmnumber: 1
zpe: 257074.0 jmol-1
zpe.correction: 0.097914 hartree
zpe.thermalcorrener: 0.108227 hartree
zpe.thermalcorrenthalpy: 0.109171 hartree
zpe.thermalcorrgfe: 0.062660 hartree
zpe.sumelectzpe: -625.839663 hartree
zpe.sumelectthermal: -625.829350 hartree
zpe.sumelectthermalent: -625.828406 hartree
zpe.sumelectthermalfe: -625.874917 hartree
dipole: -0.0025 3.3074 0.0000
dipole: 3.3074
quadrupole: -58.0570 -50.3798 -49.2784
quadrupole: -0.0032 -1.6478 -0.0006
quadrupole: -5.4852 2.1919 3.2934 -0.0032 -1.6478 -0.0006
hfenergy: -625.9375772 hartree
pointgroup: C01 [X(C3H6F4N2)]
dipole: 0.0051285 1.3011598 0.0109284 debye
dipolederiv: -0.6302104 -0.2049896 -0.187866 -0.2965591 -0.3734107 -0.1697595 -0.0043605 -0.002617 -0.2030554 -0.2548072 0.1632606 0.1461384 0.0820644 -0.3621174 -0.1592023 0.1303828 -0.4222174 -0.5995853 -0.2565717 -0.1665513 0.1445458 -0.0851315 -0.3705522 0.1623523 0.1319945 0.4253344 -0.5895857 -0.6265494 0.2099413 -0.1830147 0.298323 -0.379851 0.1679122 0.0007905 -0.0003675 -0.200072 0.7023925 0.0339492 0.0560259 0.0810485 0.5529755 0.3234125 -0.0236211 0.3462695 0.584164 0.7017066 -0.0357138 0.0529442 -0.0815834 0.5656979 -0.324182 -0.0276883 -0.3466358 0.5726628 0.3020676 0.0003309 -0.0804916 0.0008556 0.1900337 -0.0004633 -0.1321213 -0.0000416 0.271098 -0.1340128 -0.0338664 0.0323669 -0.009518 -0.0674294 0.0579918 -0.0085888 0.0184731 -0.1118888 -0.1337065 0.0333782 0.0324362 0.0100715 -0.0668553 -0.0576158 -0.0087295 -0.0177225 -0.1131447 0.0273849 0.1014744 -0.0012365 0.0858344 0.0269805 0.0172004 0.0026045 0.0153127 0.1046846 0.0045499 -0.081423 -0.0080205 -0.0771404 0.0815832 0.006186 -0.0237648 -0.0105592 0.0933336 0.1329791 0.0052259 0.0026389 0.0018975 0.0478535 -0.0941348 -0.0079553 -0.0501288 -0.0042471 0.1329637 -0.0060295 0.0035871 -0.0026284 0.0454605 0.0950206 -0.0072893 0.0510005 -0.0018605 0.0259059 -0.1013477 -0.0032097 -0.0857868 0.0295056 -0.0184714 0.0009076 -0.0167911 0.104216 0.0059077 0.0823608 -0.0068444 0.0782526 0.0801255 -0.0062467 -0.0225609 0.0106909 0.0932805 unknown
polarizability: 60.6686427|-0.0083085|54.7463187|-0.4779286|0.0095728|53.4919581 unknown
InChI: InChI=1S/C3H6F4N2/c1-3(2,8(4)5)9(6)7/h1-2H3
charge 0 multiplicity 1
15 atoms
F  2.314724 0.365813 0.547025
F  1.483561 -1.210505 -0.935438
F  -1.494664 -1.216696 0.923687
F  -2.314546 0.390961 -0.531237
N  1.146321 -0.55745 0.363333
N  -1.15253 -0.54338 -0.363446
C  0.000566 0.448223 0.008262
C  0.271528 1.270666 -1.254679
C  -0.264194 1.251723 1.284528
H  -0.501809 2.046778 -1.362373
H  1.257259 1.75551 -1.164296
H  0.271658 0.636453 -2.155246
H  -0.271532 0.602381 2.174202
H  0.516325 2.0185 1.406341
H  -1.245268 1.747124 1.200937
