program: Gaussian 09
title: 000140515
version: EM64L-G09RevD.01
frameworkgroup: C1[X(C16H17NO3)]
method: RPBEPBE
basis: SDD
operation: Freq
keyword: #p
keyword: freq=noraman
keyword: PBEPBE/SDD
title: #p freq=noraman PBEPBE/SDD
converged: YES YES NO NO
title: Mulliken charges:
elementType: O O O N C C C C C C C C C C C C C C C C H H H H H H H H H H H H H H H H H
charge: -0.261219 -0.268650 -0.247569 -0.036230 0.327526 0.318189 -0.081611 -0.363244 -0.359820 -0.355169 -0.335215 0.316297 0.317984 -0.370217 -0.353456 -0.356267 -0.352098 -0.537894 -0.538250 -0.491790 0.247449 0.242100 0.270184 0.245583 0.238832 0.239650 0.249519 0.250140 0.222397 0.221799 0.245406 0.222117 0.219095 0.244965 0.223633 0.223012 0.222823
chargesum: 0.00000
title: Mulliken charges with hydrogens summed into heavy atoms:
elementType: O O O N C C C C C C C C C C C C C C C C
charge: -0.261219 -0.268650 -0.247569 -0.036230 0.327526 0.318189 -0.081611 -0.115795 -0.117720 -0.084985 -0.089632 0.316297 0.317984 -0.131386 -0.113806 -0.106748 -0.101957 0.151708 0.147927 0.177678
polarizability: 2.80404671e+02 1.30549175e+01 2.20643617e+02 -6.77711254e-01 -3.94066050e-01 1.29681556e+02
1716.lowfreq: -35.6871 -5.6731 -0.0005 0.0003 0.0006 2.7633 5.9231 32.3332 34.0213
frequency: -35.6591 32.3152 33.9775 49.5347 84.9520 86.4139 96.8125 112.5360 147.9987 157.2232 162.1672 201.2015 217.8087 229.3001 240.5962 254.4255 267.2993 305.0673 340.9039 351.4489 375.2580 406.2773 415.3774 443.8990 465.3298 512.4359 515.3360 543.1539 580.3056 611.8870 627.5112 667.6729 677.5706 729.6264 739.6735 761.2127 787.6291 812.9020 818.4234 833.0038 841.7998 848.6611 935.3742 950.5724 957.6659 966.1358 986.3508 987.2282 987.5168 995.8380 1003.9866 1010.1896 1108.8649 1110.0437 1111.9998 1112.8250 1114.4540 1145.5416 1155.1854 1156.3660 1169.6164 1176.8972 1184.3542 1227.6429 1231.1950 1298.6010 1301.3831 1318.9910 1358.2547 1365.7538 1410.5927 1418.1695 1425.9785 1436.0430 1437.0489 1446.5441 1466.3073 1466.7716 1471.9396 1472.4403 1474.0898 1491.4152 1500.1737 1529.3832 1575.5966 1577.3732 1619.4198 1620.6986 2957.8619 2960.5896 2977.4587 3044.8971 3048.8831 3076.1396 3116.1180 3123.4378 3125.4463 3136.0878 3140.5929 3143.9416 3152.5837 3163.2261 3165.1783 3168.8565 3173.9313
redmass: 3.6547 3.4554 4.9240 4.0886 2.6305 3.9774 3.6064 2.3589 3.4123 3.4160 1.8882 3.1762 1.6020 1.7314 2.0210 2.4391 4.3519 4.1997 5.6385 5.8564 5.0181 2.9582 3.0292 4.5403 4.0365 3.1154 2.9065 4.7857 4.5485 6.3260 6.6834 5.3981 4.9685 4.4057 4.1590 5.2255 5.4210 1.3675 1.3281 1.8157 4.3489 1.5919 1.6328 1.3697 3.0759 1.4926 8.7520 1.5218 4.9588 4.6886 3.0357 2.7404 1.3507 1.2547 1.2616 1.2605 1.3258 1.6533 1.3541 1.3253 2.0396 1.3007 1.4249 3.1094 3.0860 1.2776 1.2837 4.4464 5.5210 4.9119 3.8459 1.1725 4.0188 1.1723 1.1794 1.0537 1.0510 1.0499 1.0832 1.0778 1.0551 2.5225 2.6595 6.7484 7.3667 7.6745 6.3380 6.4062 1.0331 1.0328 1.0293 1.1039 1.1039 1.1049 1.1023 1.0991 1.0995 1.0887 1.0887 1.0874 1.0879 1.0948 1.0952 1.0966 1.0972
irintensity: 0.5142 0.9818 0.2544 2.0869 0.2804 0.7930 3.4166 5.4314 3.2135 2.3577 5.7877 4.7914 0.5225 0.6668 1.5646 0.8125 2.6935 7.4887 0.3205 1.4814 5.2149 0.0280 0.0456 4.9077 1.8633 18.6652 13.6699 43.0138 44.6614 2.2111 1.6211 3.4747 9.2749 2.1366 1.5560 4.7447 1.4330 23.9055 17.4362 97.6905 22.6602 59.7340 19.7082 1.3811 70.2892 11.2670 99.1584 6.5211 32.3373 85.9038 23.3019 17.6041 13.7737 0.0192 0.3770 0.1942 6.5793 25.7239 0.5712 4.9080 38.7640 120.0922 41.7634 182.5737 168.7120 2.0197 0.8547 125.8498 6.8275 9.0925 4.1458 0.4645 22.0630 4.1607 9.3910 10.4541 13.9122 13.6029 68.0286 60.5601 14.0988 63.9397 87.8241 28.5344 12.5141 18.9727 78.0413 95.4670 69.0772 81.7725 114.7937 47.6737 47.4170 44.2963 19.5852 29.4950 28.3783 7.0612 9.3348 7.3216 2.5196 15.7902 14.6224 4.5722 6.8269
temp: 298.150 k
press: 1.00000 atm
elementType: 8 8 8 7 6 6 6 6 6 6 6 6 6 6 6 6 6 6 6 6 1 1 1 1 1 1 1 1 1 1 1 1 1 1 1 1 1
symmnumber: 1
zpe: 767589.7 jmol-1
zpe.correction: 0.292359 hartree
zpe.thermalcorrener: 0.311169 hartree
zpe.thermalcorrenthalpy: 0.312113 hartree
zpe.thermalcorrgfe: 0.244344 hartree
zpe.sumelectzpe: -898.783676 hartree
zpe.sumelectthermal: -898.764867 hartree
zpe.sumelectthermalent: -898.763923 hartree
zpe.sumelectthermalfe: -898.831691 hartree
dipole: 0.6565 -2.3628 -1.4175
dipole: 2.8326
quadrupole: -105.5372 -97.1924 -114.5590
quadrupole: 5.7327 -8.7834 3.5481
quadrupole: 0.2257 8.5705 -8.7962 5.7327 -8.7834 3.5481
hfenergy: -899.0760354 hartree
pointgroup: C01 [X(C16H17N1O3)]
dipole: -0.2338149 -0.9278187 0.5713143 debye
polarizability: 280.8477328|-11.919001|220.1636594|-2.3158379|-0.5329687|129.7184516 unknown
InChI: InChI=1S/C16H17NO3/c1-18-14-8-4-12(5-9-14)16(17-20-3)13-6-10-15(19-2)11-7-13/h4-11H,1-3H3
charge 0 multiplicity 1
37 atoms
O  5.266285 -1.045352 0.035745
O  -4.640543 -2.163361 -0.361976
O  -1.442986 3.011413 0.047494
N  -0.06301 2.536145 0.058739
C  1.351048 0.605309 0.017275
C  -1.21992 0.327836 -0.054696
C  -0.005927 1.210902 0.009762
C  1.514546 -0.802732 -0.049276
C  -1.820917 -0.16456 1.126186
C  2.527455 1.414898 0.088434
C  -1.788731 -0.027784 -1.30642
C  3.945224 -0.575689 0.025132
C  -3.513791 -1.344371 -0.182091
C  2.795363 -1.397953 -0.045884
C  -2.962312 -0.997602 1.076056
C  3.802618 0.836811 0.092543
C  -2.922654 -0.856631 -1.374951
C  5.469892 -2.494526 -0.031815
C  -5.300781 -2.677801 0.839591
C  -1.408615 4.481331 0.096443
H  0.62949 -1.444717 -0.105662
H  -1.397832 0.107104 2.099685
H  2.415395 2.50171 0.139453
H  -1.340494 0.351683 -2.2310
H  2.879922 -2.487449 -0.099086
H  -3.404476 -1.359295 2.009117
H  4.707139 1.450538 0.146724
H  -3.36906 -1.135249 -2.334323
H  5.058322 -2.915187 -0.96989
H  5.011222 -3.005828 0.836837
H  6.560768 -2.632881 -0.010346
H  -5.681187 -1.853995 1.474745
H  -4.618748 -3.317983 1.432955
H  -6.143824 -3.279227 0.468881
H  -0.88291 4.892384 -0.78416
H  -0.915972 4.832921 1.020875
H  -2.468103 4.784987 0.086802
