program: Gaussian 09
title: 000140510
version: EM64L-G09RevD.01
frameworkgroup: C1[X(C4H2I2S)]
method: RPBEPBE
basis: SDD
operation: Freq
keyword: #pfreq=noraman
keyword: PBEPBE/SDD
title: #p freq=noraman PBEPBE/SDD
converged: NO NO NO NO
title: Mulliken charges:
elementType: I I S C C C C H H
charge: 0.165219 0.165222 0.322837 -0.086423 -0.086400 -0.530261 -0.530243 0.290024 0.290026
chargesum: 0.00000
title: Mulliken charges with hydrogens summed into heavy atoms:
elementType: I I S C C C C
charge: 0.165219 0.165222 0.322837 -0.086423 -0.086400 -0.240237 -0.240217
polarizability: 1.09690217e+02 5.41151809e-05 1.42072411e+02 5.96980457e-03 4.62303636e-03 3.20952459e+01
1716.lowfreq: -10.1067 -0.0012 0.0012 0.0021 6.2610 11.5604 82.6952 133.1326 195.3865
frequency: 82.6952 133.1321 195.3773 196.7849 288.9358 316.4787 442.9350 612.0820 621.9185 695.8034 763.3774 785.3167 808.4072 859.2282 1094.1733 1153.3108 1297.4338 1414.7916 1465.6515 3242.2399 3245.8431
redmass: 81.6084 4.7261 14.4179 19.0927 18.9288 8.1093 4.2752 3.4684 8.8308 1.5509 8.7619 1.2296 5.2946 6.6648 1.7220 1.1942 2.7784 8.3316 8.9047 1.0951 1.0987
irintensity: 0.1164 0.0000 6.7615 0.1135 0.2948 0.6634 4.3325 0.0000 11.8556 0.0000 16.2698 106.9882 14.8956 73.4263 4.4578 0.1342 31.3723 0.3799 17.1069 3.6022 1.3074
temp: 298.150 k
press: 1.00000 atm
elementType: 53 53 16 6 6 6 6 1 1
symmnumber: 1
zpe: 117927.4 jmol-1
zpe.correction: 0.044916 hartree
zpe.thermalcorrener: 0.052225 hartree
zpe.thermalcorrenthalpy: 0.053169 hartree
zpe.thermalcorrgfe: 0.009186 hartree
zpe.sumelectzpe: -574.163545 hartree
zpe.sumelectthermal: -574.156237 hartree
zpe.sumelectthermalent: -574.155292 hartree
zpe.sumelectthermalfe: -574.199275 hartree
dipole: 0.0001 1.1769 -0.0004
dipole: 1.1769
quadrupole: -70.4777 -69.8866 -80.9677
quadrupole: -0.0001 0.0009 0.0001
quadrupole: 3.2996 3.8907 -7.1904 -0.0001 0.0009 0.0001
hfenergy: -574.2084616 hartree
pointgroup: C01 [X(C4H2I2S1)]
dipole: 0.4630399 -0.0000865 -0.0001532 debye
dipolederiv: -0.1884357 0.1803393 -0.0000295 0.2053819 -0.0839025 0.0000323 -0.0000627 0.0000504 0.0678719 -0.1885398 -0.1803067 -0.0000014 -0.2053567 -0.0838084 -0.0000084 -0.0000311 -0.0000279 0.0678708 -0.4883632 0.0000446 -0.0000098 0.0000567 -0.1289452 0.0000277 0.000005 0.0000257 0.1954442 0.2435246 -0.7228952 0.0001048 -0.4308346 0.3033744 -0.0000768 0.0000979 -0.0001245 -0.109393 0.2438565 0.7229305 -0.0000078 0.4308482 0.303008 0.0000139 0.0000294 0.0000645 -0.1093992 0.1142602 -0.1403139 -0.0000216 -0.1461166 -0.183308 -0.0000443 -0.0000393 -0.0000102 -0.2855217 0.114365 0.1402247 -0.0000418 0.1460351 -0.1833957 0.0000205 -0.0000477 -0.0000165 -0.28552 0.074669 0.0090421 0.0000035 -0.0038549 0.0284872 0.0000303 0.0000281 0.0000438 0.2293235 0.0746633 -0.0090653 0.0000036 0.003841 0.02849 0.0000047 0.0000205 -0.0000052 0.2293236 unknown
polarizability: 142.0724102|-0.0046054|109.6902174|0.0046222|-0.0059705|32.0952459 unknown
InChI: InChI=1S/C4H2I2S/c5-3-1-7-2-4(3)6/h1-2H
charge 0 multiplicity 1
9 atoms
I  -1.96674 1.948545 -0.00018
I  -1.967312 -1.947944 0.000124
S  2.307933 -0.000355 0.000119
C  -0.226661 0.725992 0.000115
C  -0.226906 -0.725849 0.00023
C  1.048573 1.270648 0.000007
C  1.048138 -1.270944 0.0002
H  1.33113 2.320667 -0.000199
H  1.330345 -2.321061 0.000183
