program: Gaussian 09
title: 000140504
version: EM64L-G09RevD.01
frameworkgroup: C1[X(C8H6ClNS)]
method: RPBEPBE
basis: SDD
operation: Freq
keyword: #p
keyword: freq=noraman
keyword: PBEPBE/SDD
title: #p freq=noraman PBEPBE/SDD
converged: NO NO NO NO
title: Mulliken charges:
elementType: Cl S N C C C C C C C C H H H H H H
charge: -0.052523 0.143505 0.310680 0.346252 0.342947 -0.216938 -0.777201 -0.384970 -0.252945 -0.191690 -0.783098 0.252322 0.255932 0.240377 0.260787 0.262839 0.243724
chargesum: 0.00000
title: Mulliken charges with hydrogens summed into heavy atoms:
elementType: Cl S N C C C C C C C C
charge: -0.052523 0.143505 0.310680 0.346252 0.342947 -0.216938 -0.028571 -0.124183 0.009894 0.052035 -0.783098
polarizability: 2.25858522e+02 1.53055362e+01 1.17309118e+02 -1.60386209e-01 -3.96138699e-01 4.77039520e+01
1716.lowfreq: -65.5473 -6.6257 -2.9113 -0.0015 0.0011 0.0023 5.1683 27.0972 54.3097
frequency: -65.4680 26.6998 54.2811 133.0737 213.4346 235.0240 281.3795 305.1853 340.9310 379.5276 418.2234 419.0601 501.8940 503.9344 564.9176 576.3398 704.8399 707.2356 787.4096 789.4236 898.4522 921.4837 971.1641 1009.0591 1038.0954 1068.7845 1143.0217 1195.2179 1216.7029 1273.3864 1357.5853 1404.1091 1426.6387 1452.9141 1467.7342 1472.1840 1560.2748 1598.6924 2192.8716 2992.6180 3075.2531 3114.0606 3151.8255 3170.2155 3184.1710
redmass: 1.0691 9.0769 6.8881 5.4848 4.2501 7.9091 4.7378 4.6847 6.8477 9.2267 9.8152 10.6439 3.5002 4.2843 5.4696 6.4837 2.3856 8.3853 1.6198 4.3936 1.3833 4.4585 1.3359 1.8757 1.5013 2.1202 1.6571 1.6182 2.1421 2.9263 8.1123 1.2217 2.2642 2.7963 1.0969 1.2045 5.8107 7.3847 12.8827 1.0403 1.0939 1.0992 1.0872 1.0936 1.0994
irintensity: 0.7403 0.2175 0.4174 1.1702 1.9947 0.6468 3.5352 1.6593 5.0612 2.4754 1.2370 1.0104 0.1284 0.4565 0.2913 1.8699 18.2578 99.5926 60.1422 3.3114 0.8397 19.9489 0.8894 67.1430 5.0049 6.3637 2.8438 1.2968 1.1582 2.9116 6.2753 19.6109 42.5035 12.0251 20.4292 21.6737 57.9542 42.1262 1336.7994 9.2621 10.7635 7.2328 5.4139 3.2174 5.6851
temp: 298.150 k
press: 1.00000 atm
elementType: 17 16 7 6 6 6 6 6 6 6 6 1 1 1 1 1 1
symmnumber: 1
zpe: 306838.1 jmol-1
zpe.correction: 0.116868 hartree
zpe.thermalcorrener: 0.126811 hartree
zpe.thermalcorrenthalpy: 0.127755 hartree
zpe.thermalcorrgfe: 0.079358 hartree
zpe.sumelectzpe: -1220.557199 hartree
zpe.sumelectthermal: -1220.547256 hartree
zpe.sumelectthermalent: -1220.546312 hartree
zpe.sumelectthermalfe: -1220.594709 hartree
dipole: 1.8709 1.5591 0.0415
dipole: 2.4358
quadrupole: -90.0530 -69.4372 -80.3250
quadrupole: 2.7102 0.0484 -0.0017
quadrupole: -10.1146 10.5012 -0.3866 2.7102 0.0484 -0.0017
hfenergy: -1220.6740672 hartree
pointgroup: C01 [X(C8H6Cl1N1S1)]
dipole: -0.7542647 -0.5849508 0.0852939 debye
dipolederiv: -0.5718971 0.2990538 -0.0070376 0.4117558 -0.4104971 0.0126313 -0.0133001 0.0185799 -0.0694524 -1.3518466 -0.2011174 0.0503089 -0.2839077 -0.1065121 0.0113322 0.0478439 0.0077003 -0.0634636 -2.5800591 -0.3926257 0.0982636 -0.4854115 -0.2283264 0.0289108 0.0924993 0.0289326 -0.0182034 -0.512841 0.1328956 0.0068593 0.1966647 0.1708527 -0.012464 -0.0013981 0.0173596 -0.0045134 1.4593439 0.1976091 -0.0506485 0.1253187 0.2075562 -0.0110128 -0.0396001 -0.0184929 0.0789585 0.8897729 -0.5235009 0.004331 -0.6268422 0.510063 -0.0183457 0.0074109 -0.026336 -0.0741325 0.0283781 -0.0063393 -0.0008733 -0.0084945 -0.189085 0.0127647 -0.0087919 -0.0366679 0.0567111 -0.2244628 -0.0631195 0.0035839 -0.1593233 -0.0670444 -0.0016557 0.0121325 -0.0081507 -0.1603581 -0.2538915 0.0927705 -0.0001903 0.078911 -0.2119731 0.0062543 0.0008584 0.0027169 -0.1124467 0.0713699 -0.0170696 -0.0066371 0.090558 0.0909583 -0.025267 -0.0154316 -0.0171492 -0.142431 2.9257442 0.492432 -0.1136273 0.6563053 0.0523831 -0.0251429 -0.1100172 -0.0193251 -0.072213 0.0380595 0.0521351 -0.0997686 0.0241437 0.0419327 0.0450102 -0.0603249 0.076756 0.0373801 0.1164642 -0.0208091 0.0280161 -0.0100891 0.01181 -0.0522688 0.0148154 -0.0829688 -0.050925 -0.0652938 -0.0578081 0.0724143 -0.0147314 0.0903284 -0.0102307 0.0563239 0.0181752 0.0921753 0.0136975 0.0855549 -0.0014065 0.0768938 0.0254479 0.0102395 -0.0012647 0.0099242 0.1723386 -0.029358 -0.0331486 0.0094294 -0.01733 0.0930587 0.0071354 0.0097035 0.0071545 0.1678062 0.0468198 -0.0369127 0.0069829 -0.0544213 -0.080953 0.0221095 0.0085407 0.0217913 0.1627694 unknown
polarizability: 226.5695082|11.4127713|116.0271163|-6.0493869|-5.3783387|48.2749669 unknown
InChI: InChI=1S/C8H6ClNS/c1-6-7(9)3-2-4-8(6)10-5-11/h2-4H,1H3
charge 0 multiplicity 1
17 atoms
Cl -3.174317 1.565422 -0.081843
S  4.563472 0.523337 -0.227798
N  1.795377 -0.082591 -0.120273
C  -0.51976 0.676487 -0.115055
C  0.447851 -0.38147 -0.055904
C  -1.873038 0.278355 -0.031647
C  -0.1023 2.124289 -0.243843
C  0.053722 -1.741728 0.071529
C  -2.293826 -1.059081 0.094589
C  -1.311237 -2.073594 0.144176
C  2.9730 0.177455 -0.168046
H  -0.758924 2.66393 -0.946782
H  -0.178556 2.644299 0.729804
H  0.937395 2.215723 -0.594574
H  0.824637 -2.51659 0.111524
H  -3.358249 -1.300207 0.152907
H  -1.615348 -3.120136 0.241138
