program: Gaussian 09
title: 000140473
version: EM64L-G09RevD.01
frameworkgroup: C1[X(C9H18N2O3)]
method: RPBEPBE
basis: SDD
operation: Freq
keyword: #p
keyword: freq=noraman
keyword: PBEPBE/SDD
title: #p freq=noraman PBEPBE/SDD
converged: YES YES NO NO
title: Mulliken charges:
elementType: O O O N N C C C C C C C C C H H H H H H H H H H H H H H H H H H
charge: -0.403668 -0.292232 -0.237201 -0.389162 -0.627642 -0.377076 -0.142150 -0.323310 -0.362865 -0.168718 0.216211 0.134952 -0.695669 -0.661157 0.200142 0.223708 0.291904 0.209913 0.207353 0.194622 0.195008 0.323716 0.221191 0.215144 0.214310 0.213892 0.223897 0.239826 0.182536 0.265424 0.320629 0.386472
chargesum: 0.00000
title: Mulliken charges with hydrogens summed into heavy atoms:
elementType: O O O N N C C C C C C C C C
charge: -0.017196 -0.292232 -0.237201 -0.065446 -0.041590 0.046774 0.149754 0.093956 0.026765 0.052473 0.216211 0.134952 -0.052322 -0.014897
polarizability: 1.30603664e+02 -6.06106647e+00 1.28594080e+02 5.45927426e+00 7.72772114e+00 1.04399858e+02
1716.lowfreq: -10.8894 -8.4449 -5.7432 0.0005 0.0009 0.0011 19.6983 36.7968 45.5656
frequency: 19.4908 36.7750 45.5403 50.8489 62.8480 74.3308 90.8599 119.3005 139.4827 181.5100 221.3786 226.6240 248.8285 259.2669 270.8959 289.5355 354.0303 377.7334 399.1640 410.8144 454.7967 527.1679 555.9222 578.8912 597.5900 605.0846 628.1829 701.5076 719.3694 725.6422 788.1664 823.0358 881.6141 898.7537 915.2312 953.6365 968.6669 1002.0779 1029.7348 1051.3294 1073.7370 1085.3127 1092.3239 1108.1972 1140.7916 1157.7349 1190.1282 1208.4831 1219.1266 1235.2236 1265.0270 1277.9445 1291.9440 1311.4089 1317.0008 1329.5136 1329.9788 1353.6481 1356.8464 1388.6119 1390.5438 1455.1273 1460.1281 1465.6961 1475.0355 1475.4448 1477.2675 1487.0957 1499.3631 1573.6846 1633.8680 1651.6848 2847.2633 2961.6159 2973.6552 2975.0957 2975.6954 2987.5074 3005.2134 3026.9723 3036.7725 3059.1604 3069.0971 3073.2316 3073.3176 3102.4639 3461.1347 3512.6582 3535.9427 3613.2791
redmass: 3.0162 3.5583 4.4620 1.9835 6.7846 3.8788 4.5799 3.4675 2.1154 3.6238 1.1776 1.2896 3.0457 1.1345 4.5677 2.5032 5.0776 4.0573 3.0426 2.9759 2.6726 3.0840 3.1555 1.4333 1.3165 1.7879 2.1408 3.6021 3.5225 1.1122 1.2522 4.6298 2.0060 1.6555 2.0816 2.8405 1.8851 1.4706 3.0665 2.5572 2.3870 2.1075 2.8709 2.1117 1.7538 1.5782 2.1727 1.5250 1.3284 1.7369 1.3749 1.1963 1.0862 1.4249 1.3152 1.6741 1.3974 1.8623 1.5788 1.2130 1.2141 1.1065 1.0798 1.0796 1.1028 1.0473 1.1073 1.0823 1.6996 2.3409 1.6612 7.8077 1.0802 1.0590 1.0559 1.0410 1.0385 1.0597 1.0997 1.0897 1.0941 1.1031 1.0957 1.0997 1.1007 1.1009 1.0471 1.0641 1.0769 1.0968
irintensity: 0.8273 0.4390 1.3085 0.4119 8.5267 3.7000 0.3303 1.7525 0.6484 0.7047 0.5532 1.4630 9.5094 46.5554 2.0146 5.1864 12.6097 7.4902 14.4415 5.9727 8.2080 100.2241 17.4971 22.5316 115.8803 78.2356 216.7711 40.7560 7.0552 9.8803 2.3134 9.0371 4.7504 5.7726 16.0660 5.5418 5.3147 5.2989 13.9749 204.5548 6.6168 12.6482 17.4865 14.8917 18.8113 2.2947 20.2507 1.5688 11.0649 43.7726 4.2740 4.6294 3.1988 12.8250 20.0823 84.1873 42.2963 11.0347 2.7917 16.5204 12.0082 21.8909 4.3567 5.7363 29.8753 8.8318 18.4486 14.2644 223.6696 229.0477 59.0043 175.5550 68.3476 26.3819 20.4372 23.2521 31.0618 52.6561 9.4312 2.9028 4.5105 28.4715 48.0768 63.3130 84.1889 26.9913 21.3952 30.4409 33.6626 13.9522
temp: 298.150 k
press: 1.00000 atm
elementType: 8 8 8 7 7 6 6 6 6 6 6 6 6 6 1 1 1 1 1 1 1 1 1 1 1 1 1 1 1 1 1 1
symmnumber: 1
zpe: 707912.1 jmol-1
zpe.correction: 0.269629 hartree
zpe.thermalcorrener: 0.286878 hartree
zpe.thermalcorrenthalpy: 0.287822 hartree
zpe.thermalcorrgfe: 0.222327 hartree
zpe.sumelectzpe: -687.818624 hartree
zpe.sumelectthermal: -687.801376 hartree
zpe.sumelectthermalent: -687.800432 hartree
zpe.sumelectthermalfe: -687.865927 hartree
dipole: -0.7695 1.8640 1.4462
dipole: 2.4815
quadrupole: -74.6487 -85.7898 -90.1266
quadrupole: -2.7663 0.5549 -4.0997
quadrupole: 8.8730 -2.2681 -6.6049 -2.7663 0.5549 -4.0997
hfenergy: -688.0882538 hartree
pointgroup: C01 [X(C9H18N2O3)]
dipole: -0.1693155 0.6268273 0.7290939 debye
polarizability: 124.3276753|-8.9016785|128.1237811|8.5982599|10.3131197|111.146146 unknown
InChI: InChI=1S/C9H18N2O3/c1-3-4-5-7(9(13)14)11-8(12)6(2)10/h6-7,11,13H,3-5,10H2,1-2H3
charge 0 multiplicity 1
32 atoms
O  -0.820915 3.521566 0.165673
O  1.075787 -0.671469 -1.586186
O  0.540208 2.638554 1.828411
N  0.670443 0.209468 0.522591
N  2.833332 -2.511779 -0.699033
C  -1.813592 0.663416 0.29313
C  -0.348152 1.156785 0.056631
C  -2.134506 -0.644018 -0.460839
C  -3.596372 -1.097172 -0.242043
C  2.49083 -1.469268 0.273143
C  1.348395 -0.623496 -0.344869
C  -0.130943 2.479871 0.782942
C  -3.926938 -2.407662 -0.988357
C  2.121535 -2.093647 1.644363
H  -1.975334 0.521511 1.381293
H  -2.498307 1.467395 -0.039126
H  -0.200366 1.2969 -1.030272
H  -1.941805 -0.504617 -1.542667
H  -1.446828 -1.445315 -0.127681
H  -3.781545 -1.231889 0.843646
H  -4.284818 -0.294833 -0.578291
H  0.957131 0.281413 1.501826
H  3.328867 -0.746073 0.446016
H  -3.777697 -2.290509 -2.077995
H  -4.975277 -2.715701 -0.820333
H  -3.27229 -3.23222 -0.649274
H  2.9475 -2.746844 1.977033
H  1.217104 -2.71717 1.545352
H  1.96339 -1.336745 2.437522
H  3.788111 -2.868404 -0.643231
H  2.507751 -2.293723 -1.647279
H  -0.691303 4.362971 0.682105
