program: Gaussian 09
title: 000140469
version: EM64L-G09RevD.01
frameworkgroup: C1[X(C11H18O)]
method: RPBEPBE
basis: SDD
operation: Freq
keyword: #pfreq=noraman
keyword: PBEPBE/SDD
title: #p freq=noraman PBEPBE/SDD
converged: NO YES NO NO
title: Mulliken charges:
elementType: O C C C C C C C C C C C H H H H H H H H H H H H H H H H H H
charge: -0.292703 -0.151861 -0.153279 -0.093520 -0.087542 -0.031700 -0.446346 -0.467452 -0.459964 -0.467927 -0.454137 -0.519848 0.204147 0.216002 0.194638 0.194504 0.186855 0.212525 0.189532 0.197932 0.196476 0.188954 0.226961 0.199198 0.199828 0.192230 0.194091 0.197358 0.203442 0.231605
chargesum: 0.00000
title: Mulliken charges with hydrogens summed into heavy atoms:
elementType: O C C C C C C C C C C C
charge: -0.292703 0.052287 0.062723 0.101119 0.106962 0.155155 -0.044289 -0.073044 -0.044049 -0.068901 -0.067816 0.112558
polarizability: 1.21263559e+02 -7.90612040e-01 1.03776800e+02 -1.57040111e+00 -2.97523589e-01 1.03970462e+02
1716.lowfreq: -40.5843 -6.3775 -0.0006 -0.0005 0.0005 24.6561 77.9662 132.8938 181.6844
frequency: 77.6210 132.7637 181.6579 230.8856 285.3907 304.3164 330.3054 360.3945 401.7383 414.2108 425.8757 462.8468 502.8568 626.7573 631.3911 667.4912 757.7742 794.0047 807.3880 812.0099 863.5245 871.3270 878.9965 910.2271 914.9531 959.5086 963.9354 980.2287 1021.3802 1042.6136 1046.4079 1053.5568 1070.7896 1077.6661 1097.8764 1101.6515 1107.5493 1113.2944 1114.4118 1122.6719 1150.9721 1180.3473 1214.0246 1252.2062 1266.5927 1292.6059 1295.2844 1300.5322 1307.3274 1320.2329 1323.7017 1327.9242 1333.7919 1343.3699 1354.0679 1359.6527 1362.4026 1372.2653 1432.4482 1449.8878 1453.0380 1458.4266 1465.0622 1466.2591 1476.6806 1480.7062 2896.7237 2923.9542 2957.8975 2958.9150 2962.8159 2969.6477 2975.0466 2989.0162 2993.6965 2999.0332 3002.6129 3013.6216 3015.4111 3020.3392 3024.6227 3037.1244 3048.6272 3092.3892
redmass: 2.4515 2.0535 1.5839 2.7579 2.4044 2.1791 3.0640 2.2718 2.9211 1.9390 1.7625 3.3984 4.9495 3.9780 3.8433 3.6404 4.2993 2.9484 2.6523 2.7631 1.5856 1.5600 2.8194 2.3215 2.0921 2.5043 2.1915 2.0554 6.2817 1.7707 3.0694 2.5022 1.5971 1.6559 1.4955 1.5233 1.0826 1.0328 1.0771 1.1201 1.3978 1.2169 1.0417 1.6728 1.6035 1.9355 1.8640 2.0653 2.1530 1.4264 1.3470 1.3242 1.3692 1.4702 1.4145 1.4362 1.5527 1.6133 1.1301 1.0829 1.0852 1.0615 1.0910 1.0907 1.0546 1.0873 1.0828 1.0350 1.0622 1.0617 1.0617 1.0654 1.0643 1.0844 1.0824 1.0953 1.0872 1.1029 1.0868 1.1017 1.1011 1.1010 1.0994 1.0971
irintensity: 3.2567 2.2191 0.9219 6.8797 0.2511 0.0777 0.9467 1.7116 1.2087 0.0825 0.3009 1.1372 4.7157 0.4500 0.7153 0.4356 0.5253 2.1830 1.5361 1.1220 0.5757 0.0481 10.8724 6.5547 0.5524 4.1882 8.9568 6.3685 9.3465 0.6759 65.0869 40.9407 11.9876 1.8332 4.3439 9.6091 0.7544 0.0577 0.2958 0.2939 11.4048 0.6661 2.3847 0.2774 1.0531 0.8384 0.4712 1.8302 0.2833 0.1329 0.5973 0.1095 2.2412 0.5018 3.1948 4.9347 1.3552 11.0090 3.6810 3.0159 3.4271 11.7574 17.5108 16.9812 15.7175 2.3497 62.8526 83.3716 28.0868 25.5837 35.5349 7.4911 27.2472 154.1851 156.9801 32.1543 135.5676 3.0065 40.9405 66.6117 63.9510 33.4840 35.1990 34.3419
temp: 298.150 k
press: 1.00000 atm
elementType: 8 6 6 6 6 6 6 6 6 6 6 6 1 1 1 1 1 1 1 1 1 1 1 1 1 1 1 1 1 1
symmnumber: 1
zpe: 708437.8 jmol-1
zpe.correction: 0.269830 hartree
zpe.thermalcorrener: 0.279898 hartree
zpe.thermalcorrenthalpy: 0.280842 hartree
zpe.thermalcorrgfe: 0.235092 hartree
zpe.sumelectzpe: -504.236399 hartree
zpe.sumelectthermal: -504.226331 hartree
zpe.sumelectthermalent: -504.225387 hartree
zpe.sumelectthermalfe: -504.271137 hartree
dipole: 0.0340 1.4313 -0.3455
dipole: 1.4728
quadrupole: -71.0073 -74.8149 -73.5537
quadrupole: -3.8218 0.0866 0.0147
quadrupole: 2.1180 -1.6896 -0.4284 -3.8218 0.0866 0.0147
hfenergy: -504.5062289 hartree
pointgroup: C01 [X(C11H18O1)]
dipole: 0.0246124 0.5205163 -0.2534189 debye
polarizability: 121.3021432|-1.2593431|103.6816473|-0.9158025|-0.2501324|104.0270304 unknown
InChI: InChI=1S/C11H18O/c1-12-11-9-3-7-2-8(5-9)6-10(11)4-7/h7-11H,2-6H2,1H3
charge 0 multiplicity 1
30 atoms
O  -2.284498 -0.551878 0.021874
C  -0.450858 1.190921 0.040577
C  -0.045304 -1.221278 -0.638121
C  0.991645 -0.307559 1.491696
C  1.846191 0.468774 -0.77354
C  -1.066317 -0.058418 -0.649468
C  -0.050979 0.844592 1.499091
C  0.80603 1.622226 -0.768038
C  0.355298 -1.557652 0.824092
C  1.213861 -0.784518 -1.437879
C  2.248149 0.131798 0.689063
C  -3.432717 0.339141 -0.117344
H  -1.185279 2.020926 0.036423
H  -0.517427 -2.102377 -1.112816
H  1.282475 -0.549978 2.533075
H  2.74246 0.779853 -1.346188
H  -1.325527 0.201906 -1.70451
H  -0.947796 0.534399 2.068971
H  0.36929 1.742769 1.99507
H  1.246367 2.531958 -0.313056
H  0.52248 1.883175 -1.808519
H  1.074757 -2.401195 0.826245
H  -0.539955 -1.876306 1.388937
H  0.946309 -0.564369 -2.491553
H  1.945466 -1.616856 -1.454832
H  2.715226 1.017629 1.16581
H  3.004188 -0.679478 0.695535
H  -3.62842 0.583187 -1.184307
H  -3.303931 1.287195 0.445352
H  -4.296088 -0.207789 0.29526
