program: Gaussian 09
title: 000140466
version: EM64L-G09RevD.01
frameworkgroup: C1[X(C11H8F2)]
method: RPBEPBE
basis: SDD
operation: Freq
keyword: #pfreq=noraman
keyword: PBEPBE/SDD
title: #p freq=noraman PBEPBE/SDD
converged: NO YES NO YES
title: Mulliken charges:
elementType: F F C C C C C C C C C C C H H H H H H H H
charge: -0.168937 -0.169369 0.088795 0.308393 0.308393 -0.341666 -0.341666 -0.341432 -0.341433 -0.198012 -0.198011 -0.198339 -0.198340 0.238730 0.238730 0.238655 0.238656 0.209169 0.209168 0.209258 0.209258
chargesum: 0.00000
title: Mulliken charges with hydrogens summed into heavy atoms:
elementType: F F C C C C C C C C C C C
charge: -0.168937 -0.169369 0.088795 0.308393 0.308393 -0.102936 -0.102936 -0.102777 -0.102777 0.011156 0.011157 0.010918 0.010918
polarizability: 1.69027733e+02 2.85480472e-06 1.29992888e+02 5.98599223e-03 -6.58656343e-07 6.42608037e+01
1716.lowfreq: -16.5934 0.0009 0.0009 0.0011 9.5967 12.0097 165.9567 183.3554 203.8343
frequency: 165.9566 183.3554 203.8316 230.7154 265.9763 296.2961 319.7665 405.2202 407.6658 415.8023 459.9056 483.8229 484.0082 605.1352 616.3069 640.3863 655.2221 656.1505 684.8322 783.5210 789.6455 790.2946 856.6358 867.7295 878.3910 913.3777 948.2526 955.7250 961.4554 964.9100 1018.5735 1035.5282 1057.0237 1152.6044 1159.3857 1215.0742 1219.0425 1240.2429 1272.7214 1360.1982 1370.0244 1397.5643 1418.9717 1435.8288 1440.1494 1518.5070 1519.6787 1544.9095 1584.7243 3103.3505 3104.3132 3110.3203 3112.7570 3123.8209 3125.8934 3141.1296 3142.4768
redmass: 3.9266 4.3393 9.2268 9.3229 4.1190 5.6939 2.6148 6.4407 5.4583 9.6358 9.0992 4.2805 3.8107 3.2740 4.0326 3.4067 3.7248 2.8459 1.6536 1.3277 3.5620 1.8118 1.7922 5.2502 1.4937 1.5800 3.3144 2.6118 1.3220 1.3753 4.9616 9.6676 4.4104 1.6013 1.4689 1.1615 1.2665 1.3956 1.5024 1.9876 2.8491 1.9960 5.5640 2.0294 1.8398 3.5834 7.3550 4.5094 6.8177 1.0834 1.0837 1.0870 1.0870 1.0929 1.0925 1.0961 1.0957
irintensity: 0.0000 3.0195 0.0051 0.0000 0.0379 0.4395 2.0835 0.0000 1.1642 0.7143 5.7792 3.6010 1.8785 0.0000 46.8929 1.1320 22.8799 10.7751 0.1666 0.0013 11.1841 120.3012 12.0762 0.0001 0.0093 0.0519 8.0116 13.6013 0.0017 4.2862 12.3243 43.7688 90.9698 0.0000 1.0380 5.5046 17.2504 0.0000 6.0579 0.0909 48.5412 8.4607 0.0366 1.9837 0.0000 7.7117 0.2317 7.0884 0.0003 0.0003 0.2361 4.9388 0.3645 0.4642 39.8886 61.6913 8.6630
temp: 298.150 k
press: 1.00000 atm
elementType: 9 9 6 6 6 6 6 6 6 6 6 6 6 1 1 1 1 1 1 1 1
symmnumber: 1
zpe: 405624.4 jmol-1
zpe.correction: 0.154494 hartree
zpe.thermalcorrener: 0.164252 hartree
zpe.thermalcorrenthalpy: 0.165196 hartree
zpe.thermalcorrgfe: 0.120297 hartree
zpe.sumelectzpe: -622.680973 hartree
zpe.sumelectthermal: -622.671216 hartree
zpe.sumelectthermalent: -622.670271 hartree
zpe.sumelectthermalfe: -622.715170 hartree
dipole: 0.0028 0.0000 -4.3293
dipole: 4.3293
quadrupole: -66.0629 -64.0510 -81.7029
quadrupole: 0.0000 0.0053 0.0000
quadrupole: 4.5427 6.5546 -11.0973 0.0000 0.0053 0.0000
hfenergy: -622.835467 hartree
pointgroup: C01 [X(C11H8F2)]
dipole: -0.0135759 0.0000225 -1.7032395 debye
dipolederiv: -0.3862909 0.0000048 0.2196867 0.0000047 -0.1606867 -0.0000022 0.2167181 -0.0000022 -0.5672779 -0.3930446 0.0000105 -0.2219496 0.0000106 -0.1609097 0.0000125 -0.2192811 0.0000122 -0.5605922 0.656393 -0.0000151 0.0047627 -0.0000148 0.2088372 -0.0000141 0.0052138 -0.000014 1.3424361 0.0667074 0.0004227 -0.0017998 0.0002371 -0.0931794 -0.0076122 -0.0021391 0.0580007 -0.1779483 0.0667075 -0.0004333 -0.0017989 -0.0002476 -0.0931777 0.0076138 -0.0021416 -0.0579989 -0.1779491 -0.0891616 0.080578 -0.0999014 0.0092054 0.0468443 0.075371 -0.0539048 0.1188838 -0.1025987 -0.0891679 -0.0805659 -0.0999084 -0.009196 0.0468558 -0.0753602 -0.0539132 -0.1188759 -0.1026036 -0.0874658 -0.0790424 0.0995101 -0.0084633 0.0466841 0.0757868 0.054029 0.1208025 -0.1043749 -0.0874601 0.0790483 0.0995071 0.0084706 0.0466821 -0.0757895 0.0540211 -0.120802 -0.1043801 0.104456 -0.0943153 -0.0883183 -0.0694628 0.0261801 0.0416374 -0.0001673 0.0022098 -0.1159703 0.1044688 0.0943124 -0.0883185 0.0694589 0.0261713 -0.0416282 -0.0001659 -0.0022063 -0.1159708 0.1059502 0.094066 0.0850281 0.0698459 0.0261179 0.0405074 -0.0032508 0.0007105 -0.1175022 0.1059397 -0.0940733 0.0850231 -0.0698503 0.0261302 -0.0405092 -0.0032532 -0.0007067 -0.1175033 0.0655721 -0.028255 0.0194209 0.0340449 -0.0398745 -0.0826266 -0.0052712 -0.1039286 0.1261986 0.0655717 0.0282474 0.0194269 -0.034052 -0.0398797 0.0826211 -0.0052657 0.1039245 0.1262034 0.0654564 0.0269899 -0.0184415 -0.0352746 -0.0397972 -0.0823793 0.0061337 -0.1047612 0.1260892 0.0654568 -0.0269962 -0.0184369 0.0352676 -0.039802 0.0823764 0.0061416 0.1047567 0.1260941 -0.0840106 0.0794439 0.0720619 0.0752688 0.041631 -0.0332376 0.0673187 -0.032428 0.1283478 -0.0840215 -0.0794377 0.072062 -0.0752626 0.0416394 0.0332306 0.0673193 0.0324214 0.1283491 -0.0860334 -0.0798672 -0.0688101 -0.0756399 0.0417725 -0.0320879 -0.0640727 -0.0312579 0.1304756 -0.0860231 0.0798773 -0.068806 0.0756494 0.0417608 0.03209 -0.0640686 0.0312598 0.1304774 unknown
polarizability: 169.0220184|-0.0012605|129.9928876|-0.7737444|0.0008451|64.2665181 unknown
InChI: InChI=1S/C11H8F2/c12-11(13)9-5-1-2-6-10(11)8-4-3-7-9/h1-8H
charge 0 multiplicity 1
21 atoms
F  -1.129758 0.000024 1.849055
F  1.113723 -0.000051 1.832008
C  -0.015273 -0.000002 0.950494
C  -0.022143 -1.17113 0.015456
C  -0.022065 1.17115 0.015484
C  1.248721 -1.586176 -0.486769
C  1.248826 1.586124 -0.486729
C  -1.300235 -1.585586 -0.468159
C  -1.30013 1.585702 -0.46812
C  2.350696 -0.719809 -0.639468
C  2.350743 0.71969 -0.639449
C  -2.404615 -0.719667 -0.604034
C  -2.404568 0.719858 -0.604016
H  1.328552 -2.595886 -0.910789
H  1.328723 2.595841 -0.910722
H  -1.385568 -2.594802 -0.892458
H  -1.385398 2.594933 -0.892394
H  3.283546 -1.181692 -0.987859
H  3.283625 1.18152 -0.987828
H  -3.342789 -1.181316 -0.938166
H  -3.342712 1.181576 -0.938136
