program: Gaussian 09
title: 000140462
version: EM64L-G09RevD.01
frameworkgroup: C1[X(C15H10N2O2)]
method: RPBEPBE
basis: SDD
operation: Freq
keyword: #p
keyword: freq=noraman
keyword: PBEPBE/SDD
title: #p freq=noraman PBEPBE/SDD
converged: YES YES NO NO
title: Mulliken charges:
elementType: O O N N C C C C C C C C C C C C C C C H H H H H H H H H H
charge: -0.200326 -0.210087 0.018173 -0.016572 0.345388 0.184805 -0.321468 0.338411 0.253286 -0.323313 -0.368251 -0.244343 -0.383692 -0.370894 -0.212630 -0.237092 -0.227739 -0.235086 -0.295941 0.256733 0.266415 0.288076 0.245959 0.250643 0.249785 0.246998 0.234053 0.233214 0.235494
chargesum: 0.00000
title: Mulliken charges with hydrogens summed into heavy atoms:
elementType: O O N N C C C C C C C C C C C C C C C
charge: -0.200326 -0.210087 0.018173 -0.016572 0.345388 0.184805 -0.064735 0.338411 0.253286 -0.056898 -0.080176 0.001616 -0.133049 -0.121110 0.034369 -0.003039 0.005475 0.000408 -0.295941
polarizability: 3.42951445e+02 -2.75557485e+00 2.10168211e+02 4.92810947e+00 1.42796130e+00 7.87643450e+01
1716.lowfreq: -8.6410 -7.1217 -0.0005 0.0004 0.0005 1.5319 17.5173 39.5028 42.6986
frequency: 17.1943 39.4781 42.6976 54.3420 67.8872 113.2985 143.7247 165.3455 192.8840 216.0200 282.8589 297.2524 329.3728 373.6299 396.4496 402.2726 428.4478 447.1288 478.4008 513.5637 539.2365 584.7028 614.8421 647.3562 651.9064 664.2467 673.4608 695.6253 723.1902 759.9066 775.0238 780.2133 786.6728 834.1544 851.5193 868.0705 894.7235 928.8345 977.5113 980.2376 987.8468 990.7483 1000.8412 1002.3039 1033.0481 1043.5656 1060.5450 1092.7854 1137.2807 1173.9223 1177.3473 1195.8472 1201.9572 1216.7987 1263.8425 1288.4913 1327.0031 1337.3420 1363.6257 1380.2738 1388.9385 1433.8922 1438.8697 1467.9901 1486.6804 1563.5657 1580.8845 1592.5791 1603.3970 1611.1497 2159.5118 3130.2429 3134.9764 3145.3046 3148.4913 3155.2743 3166.1100 3169.9544 3171.4938 3182.6306 3189.8325
redmass: 7.1976 9.2772 4.6115 7.4618 5.5790 5.6526 6.8664 6.2242 6.2723 6.3099 6.3836 6.2685 4.6915 7.4764 5.6048 2.9638 4.1761 6.1842 4.4211 4.7716 4.5246 6.8535 6.4504 7.2111 4.9954 5.1708 6.0968 1.8161 3.9152 4.1637 2.3396 2.1649 2.3376 4.1238 1.3396 1.4288 1.5048 1.4463 1.4278 1.4882 4.2830 4.9553 1.3486 1.3512 2.1002 3.3425 2.5513 1.6211 2.0756 1.2672 1.0565 4.0058 1.1697 1.8184 3.7669 1.7747 1.5683 1.9211 3.4178 6.4151 4.0727 2.5897 2.2957 2.4743 2.2732 6.1316 5.4451 6.9333 6.4628 6.1729 12.6409 1.0851 1.0880 1.0923 1.0873 1.0966 1.0921 1.0998 1.0895 1.0942 1.0981
irintensity: 2.6680 1.5538 1.2411 3.3499 0.2550 0.8945 3.2318 2.8050 1.2594 1.6881 3.6773 1.7598 0.8170 0.6913 1.7435 0.8745 1.0272 3.2561 4.1415 10.6498 6.1324 3.8223 0.0774 6.8832 6.5564 8.0300 10.1410 50.3530 14.6664 25.4282 27.6332 24.9623 55.2082 5.8712 0.8970 14.3676 5.7670 3.0782 1.9723 1.3384 1.1809 4.6041 0.0664 0.9582 5.9309 1.4231 10.2970 7.5268 8.9866 46.3053 0.4053 202.5921 10.6086 9.7944 18.7581 4.2954 64.1205 96.2990 64.0550 8.7277 12.5774 1.3765 15.7284 42.4082 22.8135 13.2907 21.3262 39.5222 7.0512 1.8421 18.4199 2.1362 0.4735 7.4457 2.3904 22.6430 12.5613 21.1226 12.9217 0.7847 8.5863
temp: 298.150 k
press: 1.00000 atm
elementType: 8 8 7 7 6 6 6 6 6 6 6 6 6 6 6 6 6 6 6 1 1 1 1 1 1 1 1 1 1
symmnumber: 1
zpe: 552859.4 jmol-1
zpe.correction: 0.210573 hartree
zpe.thermalcorrener: 0.226405 hartree
zpe.thermalcorrenthalpy: 0.227349 hartree
zpe.thermalcorrgfe: 0.164683 hartree
zpe.sumelectzpe: -836.139774 hartree
zpe.sumelectthermal: -836.123942 hartree
zpe.sumelectthermalent: -836.122998 hartree
zpe.sumelectthermalfe: -836.185664 hartree
dipole: -0.0969 1.3155 -2.6987
dipole: 3.0038
quadrupole: -83.3667 -119.9967 -115.3077
quadrupole: -16.6634 -0.0594 -3.8805
quadrupole: 22.8570 -13.7730 -9.0840 -16.6634 -0.0594 -3.8805
hfenergy: -836.3503469 hartree
pointgroup: C01 [X(C15H10N2O2)]
dipole: -0.1035015 -0.6782781 0.9622075 debye
polarizability: 342.2384226|-10.2350193|206.8178364|-3.127824|23.1058629|82.8277422 unknown
InChI: InChI=1S/C15H10N2O2/c16-11-14(12-6-2-1-3-7-12)10-13-8-4-5-9-15(13)17(18)19/h1-10H
charge 0 multiplicity 1
29 atoms
O  -3.116705 3.079301 0.291241
O  -0.953161 2.509387 -0.105681
N  -2.187591 2.195914 0.135103
N  0.535737 -2.946922 -1.586007
C  -1.585508 -0.28321 0.260067
C  -2.567775 0.761341 0.216788
C  -0.140666 -0.024393 0.373929
C  2.333554 -0.392928 0.071781
C  0.904156 -0.773139 -0.13262
C  -2.092914 -1.616042 0.285744
C  -3.956349 0.49451 0.202432
C  -3.472662 -1.891833 0.257095
C  2.703443 0.94634 0.385116
C  3.358937 -1.371498 -0.050878
C  -4.413298 -0.834891 0.218391
C  4.054562 1.283271 0.599732
C  4.710213 -1.030437 0.165209
C  5.064759 0.29693 0.497512
C  0.675339 -1.957807 -0.926288
H  0.136467 0.872383 0.932658
H  -1.388054 -2.447619 0.35956
H  -4.649043 1.338895 0.166348
H  -3.813504 -2.932022 0.276292
H  1.945215 1.736075 0.420372
H  3.096025 -2.403672 -0.308794
H  -5.486995 -1.044732 0.199114
H  4.322555 2.319988 0.830246
H  5.484417 -1.799561 0.072222
H  6.114347 0.56397 0.661313
