program: Gaussian 09
title: 000140445
version: EM64L-G09RevD.01
frameworkgroup: C1[X(C9H6O2)]
method: RPBEPBE
basis: SDD
operation: Freq
keyword: #p
keyword: freq=noraman
keyword: PBEPBE/SDD
title: #p freq=noraman PBEPBE/SDD
converged: NO YES NO YES
title: Mulliken charges:
elementType: O O C C C C C C C C C H H H H H H
charge: -0.185092 -0.245582 0.332625 0.332629 -0.340463 -0.340462 -0.315353 -0.315354 -0.288048 -0.288048 0.161673 0.225862 0.225861 0.281481 0.281481 0.238395 0.238394
chargesum: 0.00000
title: Mulliken charges with hydrogens summed into heavy atoms:
elementType: O O C C C C C C C C C
charge: -0.185092 -0.245582 0.332625 0.332629 -0.114600 -0.114601 -0.033871 -0.033872 -0.049653 -0.049654 0.161673
polarizability: 1.72598675e+02 8.11131338e-05 1.00771511e+02 1.00906377e-02 4.79148720e-04 4.05732535e+01
1716.lowfreq: -7.2306 -4.6542 -0.0008 -0.0006 -0.0002 11.0191 69.5079 183.8961 221.8545
frequency: 69.5053 183.8940 221.8545 307.8493 341.1159 375.9207 388.6145 424.9821 568.1658 581.2769 637.9579 683.6082 690.1961 724.0601 743.7292 759.0665 778.1891 842.7380 852.0654 861.9784 883.2052 1012.0577 1017.8941 1025.2904 1089.7045 1108.0626 1200.5098 1218.3163 1242.8699 1266.2226 1330.4676 1389.0086 1396.4422 1415.5669 1485.0944 1538.9989 1541.3337 1641.6412 1643.9827 3099.1843 3099.9407 3131.9665 3135.4264 3254.5963 3261.5327
redmass: 7.7475 3.6911 6.3234 5.3248 9.7812 2.8888 8.4019 3.2629 5.7952 3.6606 7.0981 1.7519 2.3813 5.8092 1.7302 5.7351 1.4516 3.6901 1.7978 5.0528 1.9160 1.3224 1.2818 3.3999 6.6002 2.8239 1.2108 1.2156 1.5564 2.3926 1.5421 1.7682 1.9971 3.9586 5.9830 6.9144 4.7602 7.6061 7.7760 1.0861 1.0860 1.0934 1.0935 1.0966 1.1032
irintensity: 5.8148 0.0000 4.0583 0.0402 2.1082 9.9783 11.6669 0.0000 1.5377 22.6008 14.8047 0.0000 0.0036 10.5374 0.0000 0.6948 62.2073 22.4524 0.0000 15.2798 89.6003 0.3194 0.0000 36.6804 0.0244 21.7302 6.7857 13.1876 6.0057 22.9471 3.8937 1.9372 13.4227 0.2095 151.6660 7.8316 30.6739 126.3644 5.6830 12.5791 0.0160 28.2321 1.1356 0.9153 1.0702
temp: 298.150 k
press: 1.00000 atm
elementType: 8 8 6 6 6 6 6 6 6 6 6 1 1 1 1 1 1
symmnumber: 1
zpe: 325779.5 jmol-1
zpe.correction: 0.124083 hartree
zpe.thermalcorrener: 0.132161 hartree
zpe.thermalcorrenthalpy: 0.133105 hartree
zpe.thermalcorrgfe: 0.090839 hartree
zpe.sumelectzpe: -496.198372 hartree
zpe.sumelectthermal: -496.190293 hartree
zpe.sumelectthermalent: -496.189349 hartree
zpe.sumelectthermalfe: -496.231616 hartree
dipole: -4.4944 0.0000 0.0012
dipole: 4.4944
quadrupole: -80.1970 -48.8097 -66.1575
quadrupole: 0.0000 0.0045 0.0000
quadrupole: -15.1422 16.2450 -1.1028 0.0000 0.0045 0.0000
hfenergy: -496.3224546 hartree
pointgroup: C01 [X(C9H6O2)]
dipole: -1.7682437 0.0000497 -0.0004577 debye
dipolederiv: -0.948314 0.0000163 0.0001275 0.0000104 -0.2668109 0.000001 0.0001508 0.0000022 -0.1250903 -1.1918135 0.0000144 -0.0000949 0.0000186 -0.501506 -0.0000011 -0.0001424 -0.0000018 -0.3622569 -0.276613 0.0101634 0.0000218 -0.1495571 -0.0394688 0.0000255 0.0000529 0.0000165 0.0234908 -0.2765943 -0.0101563 0.0000205 0.149567 -0.0394747 -0.0000236 0.0000631 -0.0000131 0.0234918 0.5360205 -0.0646406 -0.0000606 0.1749691 0.2017258 -0.0000539 -0.0000169 -0.0000885 -0.0944087 0.5360021 0.064628 -0.0000638 -0.1749825 0.2017311 0.0000548 -0.0000338 0.0000846 -0.0944102 0.4246713 0.0560692 -0.0000932 0.1108926 0.0898027 -0.0000329 -0.0000897 -0.000011 -0.1406597 0.424653 -0.0560826 -0.0000989 -0.1109053 0.0898133 0.0000282 -0.0000999 0.0000016 -0.1406588 -0.381081 0.2129415 -0.0000479 0.3892881 -0.1749702 -0.0000179 -0.000039 -0.0000083 -0.1456071 -0.381102 -0.2129333 -0.0000522 -0.3892723 -0.1749388 0.0000167 -0.0000426 0.0000058 -0.1456074 1.2216817 -0.0000062 0.000248 -0.000016 0.7885813 0.0000074 0.000243 0.0000083 0.1822693 0.0515086 0.0659962 0. 0.0072818 -0.0963175 0.0000302 0.0000046 0.0000242 0.1349264 0.0515044 -0.0660033 0.0000007 -0.0072896 -0.0963171 -0.0000313 0.0000077 -0.0000218 0.1349263 0.0903769 0.0230105 0.0000295 0.0071935 0.0435402 0. 0.0000272 -0.0000032 0.2232193 0.0903752 -0.0230138 0.0000323 -0.0071955 0.043542 0.0000008 0.0000325 0.0000068 0.2232188 0.0143588 -0.0843065 0.0000145 -0.037444 -0.0344635 0.0000368 -0.0000587 0.0000362 0.1515783 0.0143652 0.0843032 0.0000166 0.0374412 -0.034469 -0.0000406 -0.0000587 -0.0000385 0.151578 unknown
polarizability: 172.5986754|-0.0018094|100.7715112|-0.0100906|0.0004794|40.5732535 unknown
InChI: InChI=1S/C9H6O2/c10-9-3-1-7-5-11-6-8(7)2-4-9/h1-6H
charge 0 multiplicity 1
17 atoms
O  -3.085184 0.000056 0.000371
O  3.535776 -0.000105 0.000253
C  -0.914661 0.735361 -0.000098
C  -0.914699 -0.735356 -0.000114
C  0.224107 1.630208 -0.00037
C  0.224025 -1.630257 -0.000406
C  -2.251229 1.12578 0.000184
C  -2.251283 -1.125708 0.000178
C  1.561564 1.313508 -0.000488
C  1.561498 -1.313624 -0.000524
C  2.252379 -0.000071 -0.000346
H  -0.026536 2.70055 -0.000491
H  -0.026665 -2.700591 -0.000522
H  -2.75243 2.089524 0.000283
H  -2.752538 -2.089424 0.000293
H  2.282589 2.14221 -0.000626
H  2.282485 -2.142361 -0.000678
