program: Gaussian 09
title: 000140384
version: EM64L-G09RevD.01
frameworkgroup: C1[X(C14H14OSi)]
method: RPBEPBE
basis: SDD
operation: Freq
keyword: #p
keyword: freq=noraman
keyword: PBEPBE/SDD
title: #p freq=noraman PBEPBE/SDD
converged: NO YES NO NO
title: Mulliken charges:
elementType: Si O C C C C C C C C C C C C C C H H H H H H H H H H H H H H
charge: 1.384642 -0.293199 -0.289664 -0.289675 -0.991782 -0.992900 0.246845 0.246845 -0.322892 -0.322892 -0.374444 -0.374445 -0.261671 -0.261670 -0.212695 -0.212695 0.236351 0.248602 0.236351 0.236351 0.248675 0.236351 0.219727 0.219727 0.259942 0.259941 0.228824 0.228824 0.231315 0.231315
chargesum: 0.00000
title: Mulliken charges with hydrogens summed into heavy atoms:
elementType: Si O C C C C C C C C C C C C C C
charge: 1.384642 -0.293199 -0.289664 -0.289675 -0.270478 -0.271524 0.246845 0.246845 -0.103165 -0.103165 -0.114502 -0.114504 -0.032848 -0.032846 0.018619 0.018619
polarizability: 2.47724924e+02 4.38527803e-05 1.89835457e+02 5.21165742e-04 -1.85409622e-01 9.46554612e+01
1716.lowfreq: -17.3383 -10.4216 -7.1824 -0.0010 -0.0008 0.0010 23.5671 80.5738 87.9399
frequency: 23.5192 80.5403 87.9215 128.5079 129.6860 133.1609 155.8399 169.9898 210.7694 219.1613 251.2124 296.4218 307.7835 360.5261 393.7455 415.0704 450.0249 457.0009 517.5916 529.7013 594.8238 617.3075 638.7712 666.2208 683.4126 695.7451 722.8549 724.5264 762.1566 765.7202 769.4081 805.7086 820.0494 865.9150 866.8718 867.1189 871.4315 903.2851 947.7205 947.9609 983.5590 983.8559 1029.7047 1030.7906 1059.7761 1062.3561 1123.2455 1124.4612 1167.5654 1168.5710 1173.1160 1219.2913 1258.8980 1269.1821 1291.0543 1300.0784 1363.7334 1368.2265 1411.6261 1427.1583 1441.6418 1441.7373 1448.7975 1448.8914 1454.8581 1458.4698 1562.3138 1575.7018 1596.1854 1610.9358 2980.3443 2981.2240 3079.4222 3081.6089 3095.3000 3095.6955 3107.1678 3107.4257 3133.6927 3133.7952 3154.5402 3154.8499 3169.4723 3169.9805
redmass: 4.6867 3.2637 3.9288 1.9259 1.2821 1.2724 1.7994 2.9019 3.8936 5.2324 4.4831 4.4835 6.6827 4.9558 6.0146 6.7394 3.1196 3.2417 3.5719 3.7814 7.4780 5.9860 6.5986 5.5451 5.3061 3.0917 2.9050 2.6835 1.3733 1.3525 6.5514 1.2952 1.6658 1.7122 1.4000 1.4073 4.2394 1.4395 1.3849 1.3841 1.3180 1.3178 2.6420 2.5680 3.3897 5.0996 1.8847 1.7757 1.2395 1.0814 1.8818 2.8647 1.6262 1.4413 1.2012 1.1947 9.8368 8.7406 2.1309 2.3172 1.0525 1.0560 1.1083 2.0562 1.1224 2.1386 6.2183 6.7309 6.3176 6.7027 1.0342 1.0340 1.0984 1.0978 1.0989 1.0987 1.0884 1.0885 1.0879 1.0880 1.0943 1.0944 1.0991 1.0992
irintensity: 0.4118 0.0000 1.0899 0.0001 0.0004 0.0868 0.4560 0.3715 0.0713 4.8640 0.0001 5.8588 2.3904 0.0056 10.0811 10.9753 0.0000 23.8648 0.0001 0.0353 3.0659 5.7212 5.9395 0.0470 11.0406 16.2813 0.0002 11.6937 174.1248 0.0054 0.2652 0.0017 51.0650 17.1201 0.0316 14.0358 77.7860 94.2999 0.0005 1.4640 0.0000 0.6602 0.2785 2.4489 33.3206 1.9027 0.6479 42.8112 3.6547 4.9092 2.8098 279.0573 165.4436 0.0043 36.9154 23.2837 97.3002 1.8290 161.3906 22.7056 3.6459 0.0003 3.7745 53.8127 28.6438 17.9677 18.2010 21.1296 63.6686 3.6743 9.9731 16.5924 0.0003 30.3872 8.5204 15.4991 2.0836 21.6991 1.9244 16.6754 45.3913 7.8357 25.5592 10.3829
temp: 298.150 k
press: 1.00000 atm
elementType: 14 8 6 6 6 6 6 6 6 6 6 6 6 6 6 6 1 1 1 1 1 1 1 1 1 1 1 1 1 1
symmnumber: 1
zpe: 617006.8 jmol-1
zpe.correction: 0.235005 hartree
zpe.thermalcorrener: 0.250103 hartree
zpe.thermalcorrenthalpy: 0.251047 hartree
zpe.thermalcorrgfe: 0.192676 hartree
zpe.sumelectzpe: -905.400228 hartree
zpe.sumelectthermal: -905.385131 hartree
zpe.sumelectthermalent: -905.384187 hartree
zpe.sumelectthermalfe: -905.442558 hartree
dipole: 0.0000 1.2695 -0.0123
dipole: 1.2696
quadrupole: -88.3251 -92.2998 -107.4896
quadrupole: 0.0001 0.0003 -0.0185
quadrupole: 7.7131 3.7384 -11.4514 0.0001 0.0003 -0.0185
hfenergy: -905.6352338 hartree
pointgroup: C01 [X(C14H14O1Si1)]
dipole: 0.000023 -0.4994691 -0.0046513 debye
polarizability: 247.7249237|0.0013886|189.8355743|0.0018859|0.1524379|94.6553442 unknown
InChI: InChI=1S/C14H14OSi/c1-16(2)13-9-5-3-7-11(13)15-12-8-4-6-10-14(12)16/h3-10H,1-2H3
charge 0 multiplicity 1
30 atoms
Si 0.000061 -1.657192 0.005335
O  -0.000029 1.599985 0.013759
C  1.466141 -0.449716 -0.001222
C  -1.466082 -0.449799 -0.001359
C  0.000059 -2.750689 1.574473
C  0.000193 -2.769797 -1.550164
C  1.259718 0.95628 0.004337
C  -1.259731 0.95621 0.00429
C  2.815938 -0.90163 -0.010454
C  -2.815854 -0.901786 -0.010656
C  2.341666 1.871052 0.001999
C  -2.341735 1.870918 0.001995
C  3.90783 -0.008915 -0.013144
C  -3.907795 -0.009132 -0.013312
C  3.662543 1.386809 -0.006581
C  -3.662586 1.386604 -0.006629
H  0.894068 -3.401267 1.603393
H  -0.000028 -2.123591 2.483606
H  -0.893833 -3.40143 1.603328
H  -0.893544 -3.421059 -1.571231
H  0.000208 -2.15387 -2.466893
H  0.894002 -3.420961 -1.571137
H  3.013864 -1.981652 -0.015498
H  -3.01372 -1.981819 -0.015764
H  2.121419 2.942799 0.006621
H  -2.12155 2.942678 0.006702
H  4.934345 -0.390408 -0.020101
H  -4.934288 -0.390683 -0.020331
H  4.498619 2.095103 -0.008434
H  -4.498697 2.094857 -0.008429
