program: Gaussian 09
title: 000140383
version: EM64L-G09RevD.01
frameworkgroup: C1[X(C14H26Si2)]
method: RPBEPBE
basis: SDD
operation: Freq
keyword: #p
keyword: freq=noraman
keyword: PBEPBE/SDD
title: #p freq=noraman PBEPBE/SDD
converged: YES YES NO NO
title: Mulliken charges:
elementType: Si Si C C C C C C C C C C C C C C H H H H H H H H H H H H H H H H H H H H H H H H H H
charge: 1.252668 1.250671 -0.952832 -0.951599 0.518561 0.517334 -1.013753 -1.026203 -1.018164 -1.013837 -1.027460 -1.023705 -0.585525 -0.397999 -0.415453 -0.234124 0.237786 0.238063 0.237101 0.238111 0.232397 0.232545 0.234916 0.236054 0.227768 0.254993 0.244558 0.227911 0.234616 0.232439 0.232139 0.235009 0.235712 0.227606 0.256808 0.235056 0.254023 0.227575 0.228414 0.231582 0.228099 0.220137
chargesum: 0.00000
title: Mulliken charges with hydrogens summed into heavy atoms:
elementType: Si Si C C C C C C C C C C C C C C
charge: 1.252668 1.250671 -0.476983 -0.476387 0.518561 0.517334 -0.313895 -0.307388 -0.311079 -0.314250 -0.307333 -0.307050 -0.357111 -0.166417 -0.187354 -0.013988
polarizability: 2.55550855e+02 7.70896045e-02 1.91085340e+02 7.23406830e-02 1.67346191e+01 1.60727890e+02
1716.lowfreq: -18.2097 -17.1147 -5.6121 -5.0183 -0.0017 -0.0017 -0.0012 18.9787 39.4158
frequency: -17.4305 17.3578 39.0100 43.6696 65.5860 73.4337 109.2523 115.6710 126.4161 133.7445 135.5033 140.0938 149.6189 157.6708 165.1307 168.8939 185.6404 200.8081 207.5795 212.3576 213.7364 215.3661 269.9453 273.4995 284.6758 382.7296 435.9930 488.4370 553.6442 558.6742 573.6704 616.6536 660.5165 680.7341 688.2814 690.3007 692.4093 699.0471 711.7187 723.7665 732.6912 736.1673 742.3070 746.6607 789.7199 808.3472 822.9585 849.0872 850.6179 896.5598 898.9886 901.7760 905.2273 910.6321 915.4178 919.0475 924.8820 933.1642 977.1961 986.9608 1072.2155 1116.8125 1128.7200 1165.4687 1171.6871 1178.8206 1182.8142 1257.1108 1287.4197 1290.0374 1290.7391 1294.1219 1302.0798 1305.3985 1312.0613 1377.6330 1430.8820 1440.0698 1440.4195 1441.5652 1443.8571 1445.5640 1447.4263 1449.5259 1450.0995 1453.4562 1454.5483 1455.5769 1456.5795 1462.7507 1466.2840 1475.3687 1588.3626 1608.1950 2976.8951 2977.0143 2977.8554 2978.2906 2978.5215 2978.8164 2979.7153 2980.2122 3038.9001 3040.2256 3077.9559 3077.9940 3079.3486 3079.6797 3081.1765 3081.3680 3081.7964 3082.6093 3085.2492 3086.3457 3087.8315 3088.3413 3103.8923 3112.2988 3123.5543 3147.3529
redmass: 2.9743 3.3156 3.1314 3.0221 3.5708 3.6466 1.0243 1.0614 1.0691 1.0355 1.2001 1.2495 1.7863 2.5895 2.4619 2.6112 3.1323 2.8743 2.5712 2.6564 2.5752 2.5807 2.8238 3.5263 2.1282 2.0297 3.1345 4.9350 4.4882 4.6468 4.1633 4.6369 4.1167 3.6653 3.4813 3.5080 3.1919 2.6097 1.8417 1.3875 1.3101 1.1738 1.1936 3.4276 1.3837 1.4400 1.5104 1.4853 1.4995 1.4636 1.4358 1.5768 1.5861 1.4855 1.5902 1.5587 1.6225 2.8427 1.3292 6.1916 1.5853 1.1809 1.1448 1.4830 1.3961 1.2348 1.1531 4.2177 1.2045 1.2030 1.2028 1.2041 1.1909 1.1929 1.2653 7.1977 2.3936 1.1012 1.0593 1.0551 1.0943 1.0867 1.0617 1.0593 1.0694 1.0559 1.0516 1.0633 1.0570 1.0509 1.0480 2.4660 5.9418 6.2785 1.0364 1.0455 1.0455 1.0370 1.0494 1.0346 1.0359 1.0373 1.1006 1.1009 1.0984 1.0984 1.0983 1.0984 1.0980 1.0979 1.0977 1.0979 1.0982 1.0983 1.0978 1.0978 1.0905 1.0854 1.0916 1.0992
irintensity: 0.0116 0.0183 0.0128 0.0252 0.0255 0.0483 0.0549 0.0080 0.0957 0.0508 0.1247 0.3441 0.3313 1.0915 0.2079 0.1324 0.1961 1.0908 1.9405 3.1470 1.7929 0.8172 5.9327 5.9696 1.1594 0.9054 9.6060 1.5159 0.7630 0.2595 2.4376 5.6629 3.7193 17.6029 13.2437 7.2482 8.9766 3.9286 20.2686 2.9207 1.2405 0.1133 0.4387 5.0380 10.8842 15.5771 23.5312 9.6361 1.1822 9.8935 18.7068 60.1967 137.1334 112.7093 106.1703 15.1618 264.9179 76.2396 0.7175 0.4830 25.7802 0.6006 2.0216 1.5031 68.0172 38.3152 12.4041 9.9588 57.8354 11.3204 62.5767 31.3456 16.6309 26.4410 1.4120 0.9499 14.2635 2.4391 0.3271 0.1451 2.7170 0.8091 2.1752 1.9492 4.8817 12.5938 5.6661 8.2607 11.2520 3.3338 31.8082 29.7800 16.7674 72.0776 11.6046 2.5392 43.3468 21.6525 27.8647 19.6219 12.8918 8.0971 8.2551 9.8592 4.0845 1.2829 0.8204 3.1589 19.0557 31.3569 46.8280 38.6439 10.3169 9.6842 49.2974 16.8144 16.1258 4.1851 29.9294 26.5184
temp: 298.150 k
press: 1.00000 atm
elementType: 14 14 6 6 6 6 6 6 6 6 6 6 6 6 6 6 1 1 1 1 1 1 1 1 1 1 1 1 1 1 1 1 1 1 1 1 1 1 1 1 1 1
symmnumber: 1
zpe: 930913.3 jmol-1
zpe.correction: 0.354566 hartree
zpe.thermalcorrener: 0.376979 hartree
zpe.thermalcorrenthalpy: 0.377923 hartree
zpe.thermalcorrgfe: 0.302572 hartree
zpe.sumelectzpe: -1126.673824 hartree
zpe.sumelectthermal: -1126.651411 hartree
zpe.sumelectthermalent: -1126.650467 hartree
zpe.sumelectthermalfe: -1126.725818 hartree
dipole: 0.0176 -0.7212 0.0642
dipole: 0.7243
quadrupole: -109.7958 -115.7037 -116.8465
quadrupole: -0.0470 -0.0083 3.3147
quadrupole: 4.3195 -1.5884 -2.7311 -0.0470 -0.0083 3.3147
hfenergy: -1127.0283902 hartree
pointgroup: C01 [X(C14H26Si2)]
dipole: -0.009253 -0.2846529 -0.0090204 debye
polarizability: 255.4886128|-0.2015062|189.0551864|2.2719593|-18.3884964|162.8202864 unknown
InChI: InChI=1S/C14H26Si2/c1-15(2,3)11-13-8-7-9-14(10-13)12-16(4,5)6/h7-10H,11-12H2,1-6H3
charge 0 multiplicity 1
42 atoms
Si -3.328366 -0.900664 -0.194957
Si 3.326345 -0.962206 -0.029264
C  -2.512662 0.330381 1.069347
C  2.596798 0.455069 1.084097
C  -1.214388 0.957599 0.597523
C  1.272217 1.01647 0.603367
C  -4.889357 -1.640909 0.637391
C  -3.829993 0.030257 -1.79158
C  -2.095032 -2.299007 -0.6279
C  5.046862 -1.431236 0.676134
C  2.172433 -2.488618 0.029249
C  3.507211 -0.339334 -1.830019
C  0.040002 0.453191 1.030778
C  -1.221086 2.063183 -0.296336
C  1.230846 2.1166 -0.29511
C  -0.007054 2.633047 -0.737657
H  -2.354488 -0.230168 2.011569
H  -3.267135 1.112543 1.287746
H  3.362438 1.254421 1.13174
H  2.499496 0.04431 2.108501
H  -4.62565 -2.200305 1.55425
H  -5.606325 -0.846885 0.917881
H  -5.408143 -2.338318 -0.046458
H  -4.278637 -0.668266 -2.522484
H  -4.573671 0.821001 -1.579803
H  -2.951366 0.502488 -2.266769
H  -1.166214 -1.883675 -1.059897
H  -1.822352 -2.887832 0.267574
H  -2.53466 -2.99252 -1.368831
H  5.735917 -0.566401 0.656991
H  4.966378 -1.778911 1.722997
H  5.508292 -2.244079 0.084941
H  2.535249 -3.280115 -0.652849
H  2.1293 -2.915428 1.048822
H  1.143217 -2.224123 -0.273663
H  3.856914 -1.15215 -2.4934
H  2.54097 0.029541 -2.219219
H  4.238743 0.487691 -1.894288
H  0.057688 -0.390404 1.734333
H  -2.17764 2.482657 -0.631502
H  2.168952 2.574101 -0.632815
H  -0.025446 3.491902 -1.419029
