program: Gaussian 09
title: 000140360
version: EM64L-G09RevD.01
frameworkgroup: C1[X(C7H12SSi)]
method: RPBEPBE
basis: SDD
operation: Freq
keyword: #p
keyword: freq=noraman
keyword: PBEPBE/SDD
title: #p freq=noraman PBEPBE/SDD
converged: YES YES NO NO
title: Mulliken charges:
elementType: S Si C C C C C C C H H H H H H H H H H H H
charge: 0.210780 1.346935 -0.562814 -1.031847 -1.001332 -1.000752 -0.216723 -0.134777 -0.518559 0.240395 0.240357 0.240982 0.242275 0.230740 0.240769 0.241092 0.230593 0.241684 0.252719 0.243628 0.263856
chargesum: 0.00000
title: Mulliken charges with hydrogens summed into heavy atoms:
elementType: S Si C C C C C C C
charge: 0.210780 1.346935 -0.562814 -0.310114 -0.287548 -0.287384 0.035996 0.108851 -0.254703
polarizability: 1.39591038e+02 -2.26334182e+00 1.16109444e+02 4.29013686e-03 -1.15478409e-02 7.81216788e+01
1716.lowfreq: -12.7860 -2.4399 -0.0004 0.0012 0.0019 9.0272 21.9046 90.2916 105.9221
frequency: 21.2545 90.2764 105.9085 124.4379 144.2809 151.0532 184.7988 185.8474 192.5700 255.2137 273.6335 367.2926 471.8660 572.5127 588.7612 608.7918 684.0047 692.8703 699.9217 700.3073 741.5662 806.8615 813.0569 815.7484 836.1998 901.8480 904.3266 907.0434 909.1642 957.5256 1053.7409 1092.1761 1205.4522 1293.3500 1293.7966 1306.6959 1310.6747 1439.9165 1445.3664 1446.9564 1451.4717 1452.1469 1455.2396 1463.1072 1516.4441 2981.3091 2981.9268 2983.8458 3083.4244 3084.6195 3086.5817 3090.1671 3091.6038 3091.7476 3160.0701 3179.6521 3233.5789
redmass: 4.5316 3.2290 3.1333 1.0219 1.0646 1.0307 2.6234 2.5414 2.6519 3.8324 4.3214 5.2606 5.2167 3.1645 7.8169 4.6445 7.1484 3.1407 1.1902 3.2474 1.1671 2.0046 1.3138 2.1766 1.2751 1.7104 1.5028 1.5630 1.3778 3.3211 1.8036 1.1635 1.3722 1.2034 1.2150 1.1977 2.0211 1.0545 1.0543 1.0571 1.3463 2.9366 1.0501 1.0484 4.8988 1.0341 1.0341 1.0341 1.0986 1.0983 1.0976 1.0991 1.0983 1.0983 1.0899 1.0964 1.1005
irintensity: 0.1630 0.5368 0.0460 0.0009 0.0127 0.0014 0.0665 0.0543 1.1932 6.9904 5.6333 15.0730 12.3744 0.6263 4.0079 7.0781 5.6810 4.1908 108.8711 8.3742 0.0129 25.4314 35.3971 0.2455 4.7058 93.1640 86.9648 91.5133 0.0026 120.8241 2.3405 11.4449 37.2385 41.7544 43.5158 10.2984 6.8012 0.1912 0.8458 2.5967 16.4660 0.2848 10.3084 14.1328 4.0838 14.1054 15.5900 11.2752 0.3251 5.9824 47.3390 1.6842 24.8642 23.3223 5.8666 7.8910 1.3355
temp: 298.150 k
press: 1.00000 atm
elementType: 16 14 6 6 6 6 6 6 6 1 1 1 1 1 1 1 1 1 1 1 1
symmnumber: 1
zpe: 436541.3 jmol-1
zpe.correction: 0.166270 hartree
zpe.thermalcorrener: 0.178488 hartree
zpe.thermalcorrenthalpy: 0.179432 hartree
zpe.thermalcorrgfe: 0.127284 hartree
zpe.sumelectzpe: -960.709795 hartree
zpe.sumelectthermal: -960.697576 hartree
zpe.sumelectthermalent: -960.696632 hartree
zpe.sumelectthermalfe: -960.748780 hartree
dipole: 0.4544 0.8030 -0.0012
dipole: 0.9226
quadrupole: -63.3857 -68.2133 -73.9287
quadrupole: -0.8747 -0.0120 -0.0040
quadrupole: 5.1235 0.2959 -5.4195 -0.8747 -0.0120 -0.0040
hfenergy: -960.8760643 hartree
pointgroup: C01 [X(C7H12S1Si1)]
dipole: -0.148404 0.2986761 -0.1432668 debye
dipolederiv: -0.1122736 -0.0272866 0.0110522 -0.0992249 -0.2265495 0.1559865 0.0444532 0.1562005 0.0303685 1.8021396 -0.0193447 0.0144871 0.0142668 1.1354536 0.058811 -0.0021991 0.0581334 1.2311025 -0.4807935 -0.1225565 0.0583593 -0.1183591 -0.0177086 -0.216183 0.057398 -0.2152307 -0.36704 -0.401209 0.0735395 -0.0349658 0.0549496 -0.401438 0.0552441 -0.027693 0.0561297 -0.3084845 -0.400875 -0.0030812 0.0468278 -0.0135095 -0.2840063 0.0138544 0.0359979 0.0145851 -0.4393275 -0.4003261 -0.0337126 -0.0322823 -0.0353785 -0.3891875 -0.0742014 -0.0104394 -0.076589 -0.3348878 -0.0535801 -0.1383599 0.0672924 0.0362993 -0.105151 -0.0217317 -0.0170202 -0.0239238 -0.1415542 -0.0329946 0.0803851 -0.0375524 -0.0065198 -0.1640877 0.015969 0.0042576 0.0159341 -0.1393988 -0.0663822 0.1941979 -0.0906346 0.2171468 0.0687339 -0.1849603 -0.1005604 -0.1847629 -0.2364154 0.098129 -0.0292913 0.0726124 -0.0313233 0.0865169 0.064413 0.0734899 0.0357453 -0.1119476 -0.1619273 0.0381554 -0.0227878 0.0710659 0.1014579 0.0038721 -0.0375597 0.0033505 0.1050912 0.1011928 -0.0682142 -0.0221361 -0.06913 -0.0797497 -0.1075126 -0.0210898 -0.0785433 0.0509064 0.1045932 -0.0375886 -0.0326587 -0.0353044 -0.0210507 -0.1099738 -0.0564962 -0.1231793 -0.0134072 -0.1836256 -0.0094165 0.0320966 -0.0154846 0.1080566 -0.0011109 0.0865707 -0.0012522 0.0963368 0.1025799 0.056877 -0.03482 0.0542695 -0.0517924 0.0937427 -0.0491308 0.1012219 0.0389355 0.0992669 0.0691448 -0.0203979 0.0813664 -0.093394 0.0589498 -0.008955 0.0531731 0.0850087 -0.1817766 -0.0380473 -0.0101522 -0.0836572 0.0995913 -0.0065461 -0.042982 -0.0059012 0.1017384 0.1048576 -0.0014556 0.0483821 0.018077 0.0991002 -0.0155692 0.058421 -0.0031848 -0.1356001 0.1075206 0.0488703 -0.0239646 0.0668687 -0.0193893 0.0892821 -0.0325468 0.0896066 0.1241515 -0.0144353 -0.0750923 0.0337021 -0.1123887 0.0486191 0.070705 0.0514272 0.0709821 0.16627 -0.0300806 0.0422774 -0.0224596 0.0059698 0.1059751 0.0569593 -0.0053432 0.0575051 0.1981537 unknown
polarizability: 139.8019132|0.2761521|108.9154669|0.4983111|-14.6573631|85.1047806 unknown
InChI: InChI=1S/C7H12SSi/c1-9(2,3)7-5-4-6-8-7/h4-6H,1-3H3
charge 0 multiplicity 1
21 atoms
S  1.298633 -1.353606 0.719191
Si -1.574323 0.00669 0.043337
C  0.328326 0.031905 0.051298
C  -2.157773 1.658045 -0.725201
C  -2.215403 -0.166771 1.838007
C  -2.18792 -1.474159 -1.00236
C  1.197257 1.018971 -0.410069
C  2.601849 0.718514 -0.254163
C  2.835602 -0.513746 0.333828
H  -1.780635 1.774459 -1.757513
H  -3.262157 1.693399 -0.763167
H  -1.812418 2.522619 -0.129698
H  -1.871722 0.677836 2.461873
H  -3.320952 -0.186504 1.859921
H  -1.84827 -1.101414 2.30029
H  -1.784274 -2.427133 -0.614035
H  -3.291941 -1.537661 -0.983049
H  -1.865592 -1.373078 -2.054367
H  0.837208 1.950319 -0.856558
H  3.403845 1.391967 -0.566884
H  3.782361 -0.995851 0.572119
