program: Gaussian 09
title: 000140354
version: EM64L-G09RevD.01
frameworkgroup: C1[X(C8H17NO2Si)]
method: RPBEPBE
basis: SDD
operation: Freq
keyword: #p
keyword: freq=noraman
keyword: PBEPBE/SDD
title: #p freq=noraman PBEPBE/SDD
converged: YES YES NO NO
title: Mulliken charges:
elementType: Si O O N C C C C C C C C H H H H H H H H H H H H H H H H H
charge: 1.479036 -0.537964 -0.533374 -0.218289 -0.817402 -0.387514 -0.353758 -0.365867 -0.362281 -0.274404 -0.287891 -1.068744 0.227028 0.244579 0.217736 0.209443 0.219990 0.211561 0.210618 0.227519 0.208888 0.226692 0.216932 0.187596 0.220502 0.179740 0.255146 0.225057 0.239425
chargesum: 0.00000
title: Mulliken charges with hydrogens summed into heavy atoms:
elementType: Si O O N C C C C C C C C
charge: 1.479036 -0.537964 -0.533374 -0.218289 -0.345795 0.039665 0.077793 0.072270 0.073299 0.130124 0.112351 -0.349117
polarizability: 1.23980135e+02 -2.45533976e+00 1.14238682e+02 6.57390848e-01 3.59972749e-01 1.10875165e+02
1716.lowfreq: -16.4918 -12.7132 -0.0012 -0.0010 0.0017 11.9245 80.9241 131.1680 141.1816
frequency: 80.7161 131.1197 141.1751 143.4111 190.9170 196.1807 203.4779 239.7460 248.3053 286.3397 308.4599 326.3004 404.6952 406.4939 421.8710 499.3736 518.3000 556.0305 573.0910 636.3566 660.4896 700.2480 735.8374 769.6105 851.2965 859.7627 868.5475 873.1316 878.8742 907.2834 921.2588 980.2534 993.7753 1037.0751 1054.0591 1070.8201 1074.9839 1079.3035 1107.0421 1151.4993 1165.6475 1191.2039 1218.8533 1226.2622 1249.7735 1262.1885 1276.4410 1281.9539 1303.3755 1333.2045 1343.6707 1347.0949 1358.1573 1361.2963 1362.4211 1430.7049 1440.8337 1450.6911 1454.4365 1458.0776 1466.6474 1475.2023 1482.0692 1484.6060 2931.5887 2935.5907 2938.2532 2945.4577 2952.0037 2969.0563 2983.1690 2991.1935 3023.3566 3035.5818 3036.3352 3037.8357 3046.9476 3055.9080 3062.8045 3094.0242 3103.6134
redmass: 3.0614 2.8236 1.4368 1.7407 2.8410 2.5634 4.3272 2.5661 3.6737 1.9855 2.8137 3.3711 2.8163 2.7177 3.6886 2.7071 3.3652 2.6170 2.7494 4.8328 3.7411 3.3403 2.7397 1.8818 1.5978 1.8544 1.5763 1.8511 2.2120 2.0408 2.1271 1.8718 1.6530 1.9527 2.6890 3.6163 2.3132 3.6586 1.7585 1.8295 1.3999 1.2906 1.3059 1.2763 1.2714 1.3868 1.4536 1.4139 1.2093 1.3878 1.2562 1.2681 1.3530 1.3393 1.3357 1.0832 1.0514 1.0520 1.0933 1.0911 1.0860 1.0838 1.0800 1.0813 1.0669 1.0667 1.0663 1.0681 1.0689 1.0610 1.0620 1.0345 1.0974 1.0960 1.0937 1.0949 1.0994 1.0962 1.0957 1.0983 1.0981
irintensity: 9.2390 2.3292 1.0441 2.1556 14.6051 2.9539 30.6332 1.9386 11.1924 0.8348 0.3191 8.2580 1.4612 0.4442 1.6170 11.2093 10.5931 24.6636 8.5203 49.6239 54.1642 72.2692 14.8450 52.7632 55.8762 28.2281 31.7721 34.9179 40.1416 29.8103 24.7298 22.7465 17.9448 13.4937 24.8894 64.7067 62.7904 97.9508 15.8661 15.7146 5.3119 5.1509 1.6787 4.1939 5.9582 12.1647 16.0605 11.4615 51.7590 0.8536 2.2771 0.8587 1.1923 2.7942 3.7039 9.1688 7.2981 7.7926 2.9325 7.6034 3.4214 17.0608 5.9289 7.4948 32.3861 16.9746 43.5095 140.3675 161.1380 21.3503 52.7879 14.3296 24.6743 27.7609 58.5964 23.9736 30.7758 41.1846 47.2552 20.2475 15.1103
temp: 298.150 k
press: 1.00000 atm
elementType: 14 8 8 7 6 6 6 6 6 6 6 6 1 1 1 1 1 1 1 1 1 1 1 1 1 1 1 1 1
symmnumber: 1
zpe: 649901.5 jmol-1
zpe.correction: 0.247534 hartree
zpe.thermalcorrener: 0.260227 hartree
zpe.thermalcorrenthalpy: 0.261171 hartree
zpe.thermalcorrgfe: 0.210019 hartree
zpe.sumelectzpe: -808.705824 hartree
zpe.sumelectthermal: -808.693132 hartree
zpe.sumelectthermalent: -808.692188 hartree
zpe.sumelectthermalfe: -808.743339 hartree
dipole: 4.7545 1.0721 0.2894
dipole: 4.8824
quadrupole: -81.7780 -77.9271 -81.0436
quadrupole: -4.2596 0.3665 0.5761
quadrupole: -1.5284 2.3224 -0.7940 -4.2596 0.3665 0.5761
hfenergy: -808.9533588 hartree
pointgroup: C01 [X(C8H17N1O2Si1)]
dipole: -1.8719454 0.4196111 -0.0978187 debye
polarizability: 124.0126445|2.4461847|114.1596239|0.1854483|-0.6382553|110.9217139 unknown
InChI: InChI=1S/C8H17NO2Si/c1-12-8-2-3-9(4-6-10-12)5-7-11-12/h2-8H2,1H3
charge 0 multiplicity 1
29 atoms
Si 1.328261 0.096181 -0.052644
O  1.015203 -0.742882 1.47598
O  0.987362 -0.7957 -1.54697
N  -1.188591 -0.070632 -0.018661
C  0.844823 1.96618 -0.106362
C  -0.578088 2.29638 0.395291
C  -1.612542 1.336275 -0.237928
C  -1.438888 -0.60597 1.34095
C  -1.431079 -1.008819 -1.13926
C  -0.214641 -1.450652 1.765832
C  -0.311961 -0.804916 -2.188317
C  3.224835 -0.011097 -0.063923
H  0.968285 2.299952 -1.158672
H  1.602089 2.518731 0.483204
H  -0.861793 3.340489 0.157012
H  -0.612955 2.205004 1.498696
H  -2.632799 1.522486 0.16358
H  -1.650654 1.515776 -1.328961
H  -2.375398 -1.203785 1.397035
H  -1.539522 0.24975 2.031263
H  -2.436313 -0.878951 -1.597643
H  -1.364857 -2.038553 -0.744522
H  -0.241085 -1.64756 2.853249
H  -0.219851 -2.4297 1.239723
H  -0.317495 -1.629565 -2.924219
H  -0.475024 0.146626 -2.741091
H  3.542178 -1.048953 -0.264626
H  3.658437 0.636506 -0.847528
H  3.637364 0.290897 0.915113
