program: Gaussian 09
title: 000140352
version: EM64L-G09RevD.01
frameworkgroup: C1[X(C7H10O2)]
method: RPBEPBE
basis: SDD
operation: Freq
keyword: #pfreq=noraman
keyword: PBEPBE/SDD
title: #p freq=noraman PBEPBE/SDD
converged: YES YES NO NO
title: Mulliken charges:
elementType: O O C C C C C C C H H H H H H H H H H
charge: -0.266228 -0.245522 0.006720 -0.576377 -0.612938 0.478953 -0.754560 0.282387 -0.754098 0.260024 0.260103 0.231419 0.243424 0.248077 0.227428 0.229469 0.247302 0.248643 0.245775
chargesum: 0.00000
title: Mulliken charges with hydrogens summed into heavy atoms:
elementType: O O C C C C C C C
charge: -0.266228 -0.245522 0.266744 -0.084855 -0.121436 0.478953 -0.297663 0.282387 -0.012378
polarizability: 1.13523390e+02 -1.02829080e+00 7.12878762e+01 5.51407831e-01 9.11972349e-01 5.65721347e+01
1716.lowfreq: -3.3153 -0.0011 -0.0006 -0.0004 7.4999 15.6924 22.2529 37.4709 59.8289
frequency: 22.0553 36.4477 59.8070 105.2170 174.9556 281.2556 301.8333 377.7880 405.7910 444.6121 560.5458 570.7863 633.4186 666.6609 762.4137 832.8603 852.2537 897.0025 915.0971 924.3049 980.7888 996.2690 1029.6327 1041.8326 1058.2257 1063.3900 1169.5669 1175.8720 1202.5196 1215.1975 1228.7975 1244.8662 1334.7723 1382.5406 1422.4636 1430.9828 1448.3142 1452.9960 1454.8162 1651.9340 1717.1193 3007.7627 3007.8974 3013.5438 3062.6425 3087.5124 3090.4263 3095.8649 3096.1663 3142.7668 3193.0736
redmass: 1.1282 4.3741 3.2298 2.7869 3.8097 3.8500 3.6859 2.5178 2.3938 2.0918 4.1545 3.0762 1.0780 3.7069 3.0081 1.3990 3.7017 1.8049 4.7469 1.3120 1.9476 1.6033 2.5026 1.6712 1.7367 2.5100 1.3999 1.6702 3.4506 1.5121 1.4278 1.8653 1.3162 1.2514 1.1348 1.0850 1.1177 1.0619 1.0475 9.4372 7.1644 1.0603 1.0369 1.0626 1.0897 1.1027 1.0631 1.1016 1.0977 1.1010 1.1141
irintensity: 0.8914 1.2640 0.5577 2.8908 5.1945 4.1819 3.3716 10.4793 4.4490 1.4321 8.3802 6.3925 0.3964 2.6794 3.0397 4.7140 9.9381 0.2263 37.1417 77.9416 17.1941 29.5105 65.7821 12.0868 11.9772 66.3691 14.9277 11.9629 346.6461 10.5429 10.7940 2.9482 8.3697 52.8725 4.8192 22.0729 7.3239 27.1557 19.2165 188.2449 26.2677 22.2484 2.8214 7.1872 3.6276 19.0039 7.2516 20.4178 12.6261 10.9589 14.3322
temp: 298.150 k
press: 1.00000 atm
elementType: 8 8 6 6 6 6 6 6 6 1 1 1 1 1 1 1 1 1 1
symmnumber: 1
zpe: 402696.9 jmol-1
zpe.correction: 0.153379 hartree
zpe.thermalcorrener: 0.163236 hartree
zpe.thermalcorrenthalpy: 0.164180 hartree
zpe.thermalcorrgfe: 0.116182 hartree
zpe.sumelectzpe: -422.455012 hartree
zpe.sumelectthermal: -422.445156 hartree
zpe.sumelectthermalent: -422.444211 hartree
zpe.sumelectthermalfe: -422.492209 hartree
dipole: -0.2739 -1.6520 0.6822
dipole: 1.8081
quadrupole: -50.2018 -56.1284 -53.2714
quadrupole: -5.0720 3.8512 3.0488
quadrupole: 2.9987 -2.9279 -0.0709 -5.0720 3.8512 3.0488
hfenergy: -422.6083912 hartree
pointgroup: C01 [X(C7H10O2)]
dipole: -0.1171818 0.61429 -0.3390847 debye
dipolederiv: -1.7733058 0.2119444 -0.0368007 0.305801 -0.537256 0.0849409 0.0549872 0.0920762 -0.3479653 -0.6932897 -0.027071 0.0626832 0.3358265 -0.7595914 0.2670855 -0.1523271 0.2954667 -0.4882535 0.9863348 0.0428291 0.0000236 0.193934 0.2217963 0.0033678 -0.1844188 0.0510462 0.3195591 -0.1604104 0.014664 -0.0287884 0.0608929 -0.0339812 -0.1359319 0.0586389 -0.1276894 0.0252603 -0.087343 -0.0046661 -0.0619249 -0.0852405 -0.1233245 -0.0238369 -0.048204 -0.0250052 0.1379041 0.3619069 0.0144319 0.0401939 0.0259167 0.2334461 0.1069534 -0.0748709 0.0851631 -0.0272832 -0.3360756 -0.0553796 -0.0336909 -0.0658604 -0.0192246 0.1458788 -0.0006152 0.1540349 -0.3939956 1.7979174 -0.1526844 -0.1108654 -0.6424599 0.9887035 -0.453399 0.1145375 -0.4765225 0.4974183 -0.2846813 -0.1162051 0.1178534 -0.1761607 -0.1027759 0.1168858 0.1783413 0.1098648 -0.0697155 -0.0425027 0.0089543 -0.0520735 -0.0459399 0.0538381 0.0547789 0.0050583 0.0185308 -0.0825532 0.0136797 0.0079945 -0.0031981 -0.000477 -0.1032077 0.0341583 -0.0308893 0.0709792 0.0894576 0.0190066 0.0109331 0.0714539 0.022896 0.0846943 0.0203004 0.0805364 -0.0198509 -0.0778379 0.0658973 -0.0589384 0.0294588 -0.0581281 -0.0016842 0.0665148 0.0143222 0.0983551 0.0007599 0.0026858 0.0328121 0.0430311 0.0243994 0.0173973 -0.0924614 0.0281794 -0.1412597 -0.0532175 -0.0257636 0.0738321 0.0188236 0.1051176 -0.005185 -0.0674709 0.0385523 -0.0725319 0.169919 0.0395966 -0.0420838 -0.0217333 -0.0787093 -0.0537979 -0.0916341 -0.0299993 -0.0845969 0.1624659 0.0835597 -0.0138466 -0.0572495 0.0069119 0.1325113 0.0044496 -0.0176845 0.02002 -0.0695437 0.0924647 -0.0040583 0.0266232 -0.0281431 -0.0425464 -0.0684388 -0.0103759 -0.0843121 0.0969086 -0.0596773 0.0565379 -0.0038199 0.0994229 0.0501878 0.0278587 -0.0237684 0.0362316 0.1107125 unknown
polarizability: 113.4729085|1.8385561|71.3675884|-0.0970485|-0.7074439|56.5429035 unknown
InChI: InChI=1S/C7H10O2/c1-5-3-7(4-5)9-6(2)8/h7H,1,3-4H2,2H3
charge 0 multiplicity 1
19 atoms
O  1.005946 0.655799 -0.118815
O  2.184754 -1.15404 0.767115
C  -0.240055 0.12518 0.476135
C  -1.029433 -0.930349 -0.37194
C  -1.430096 1.122059 0.345015
C  -2.279434 -0.057713 -0.162703
C  -3.606326 -0.283294 -0.254336
C  2.172938 -0.091313 0.107174
C  3.359647 0.57608 -0.553453
H  -0.034029 -0.220539 1.502221
H  -1.046118 -1.963933 0.008251
H  -0.686029 -0.935877 -1.42363
H  -1.228876 1.873353 -0.4410
H  -1.760851 1.637939 1.260987
H  -4.338339 0.489439 0.007862
H  -4.000711 -1.246101 -0.599249
H  3.187542 0.667301 -1.639941
H  3.492005 1.597206 -0.155989
H  4.267664 -0.015597 -0.369106
