program: Gaussian 09
title: 000140348
version: EM64L-G09RevD.01
frameworkgroup: C1[X(C14H20ClNO2)]
method: RPBEPBE
basis: SDD
operation: Freq
keyword: #p
keyword: freq=noraman
keyword: PBEPBE/SDD
title: #p freq=noraman PBEPBE/SDD
converged: YES YES NO NO
title: Mulliken charges:
elementType: Cl O O N C C C C C C C C C C C C C C H H H H H H H H H H H H H H H H H H H H
charge: -0.073252 -0.285912 -0.318730 -0.681529 -0.369370 -0.372361 -0.351696 -0.394334 -0.355721 -0.273005 -0.695342 0.230982 0.083197 0.336614 -0.285011 -0.387052 -0.122674 -0.194597 0.192296 0.192633 0.194056 0.193306 0.188331 0.188319 0.213548 0.214000 0.195665 0.195851 0.226422 0.228500 0.209979 0.216481 0.209886 0.291503 0.226022 0.253124 0.303520 0.376350
chargesum: 0.00000
title: Mulliken charges with hydrogens summed into heavy atoms:
elementType: Cl O O N C C C C C C C C C C C C C C
charge: -0.073252 -0.285912 -0.318730 -0.001659 0.015560 0.015001 0.024954 0.033214 0.035794 0.181917 -0.058996 0.230982 0.083197 0.336614 0.006492 -0.161030 -0.122674 0.058526
polarizability: 2.47585687e+02 3.42428335e+00 2.04915211e+02 -1.42055461e+00 4.18163388e-01 1.00561813e+02
1716.lowfreq: -3.8298 -0.0010 0.0010 0.0016 0.2931 4.4776 16.4065 27.9218 29.9313
frequency: 16.3687 27.9194 29.9179 51.2672 77.2730 80.1758 81.4104 113.9359 124.5695 130.0150 143.9646 157.5561 168.8031 190.3737 230.7875 232.5213 303.1466 314.7148 343.7041 353.9494 366.2738 407.3163 428.4925 449.4149 461.2635 469.4806 521.4514 525.6887 632.6474 673.9824 690.9201 722.4501 725.5016 735.5148 766.5153 768.7310 787.6226 811.3876 826.9516 848.8618 889.5102 911.3426 912.9019 913.4313 946.2623 999.1075 1002.5090 1030.2583 1040.0336 1053.2140 1062.6609 1080.3490 1088.7844 1093.9841 1125.7074 1150.7729 1162.8436 1191.4898 1226.7729 1231.7106 1243.1165 1266.7074 1276.4365 1279.3332 1280.8796 1289.4978 1295.6126 1320.0544 1323.1443 1350.0820 1356.6441 1371.1238 1389.4070 1394.6350 1415.1255 1462.2755 1463.6853 1467.8407 1472.3646 1477.4913 1479.1032 1480.0452 1486.2421 1490.2929 1531.5145 1573.9946 1620.4123 1629.8455 2952.6971 2954.4546 2961.6935 2969.0062 2972.2245 2987.6088 2989.5719 2998.7716 3000.6317 3016.5821 3034.5300 3046.1541 3068.5908 3071.5866 3075.2133 3133.4643 3169.2124 3189.1577 3402.1260 3648.9513
redmass: 4.4154 5.0896 1.8726 2.7633 2.5476 4.5083 2.8462 3.5562 1.8892 6.0752 2.5058 5.1517 4.8922 4.1705 2.8452 1.3490 4.0574 5.3844 5.1234 9.5843 4.6250 6.2992 2.3662 3.3229 1.4016 3.0109 3.2122 4.2382 7.6132 5.3959 8.4415 1.0637 1.3909 1.0862 1.3678 1.7481 6.2080 1.5978 1.1894 7.7516 1.8996 1.3039 4.7828 1.4253 1.3406 1.1677 3.8664 3.3363 2.2347 2.4964 3.0353 2.1300 2.3084 2.6178 2.9140 1.4555 1.1519 1.5860 1.3047 1.3386 2.1977 1.1999 1.3516 1.0688 1.8236 1.0881 1.1106 1.5498 1.9283 1.5194 1.6578 1.8516 1.2181 3.9007 5.9547 1.0723 1.0744 1.0740 1.0764 1.0437 1.0994 2.6607 1.0861 1.0965 3.9336 8.3830 1.4613 7.6696 1.0588 1.0587 1.0592 1.0588 1.0365 1.0971 1.0596 1.1001 1.0565 1.1032 1.1041 1.1044 1.1007 1.0993 1.1079 1.0890 1.0960 1.0923 1.0562 1.0945
irintensity: 0.3701 0.1607 0.0631 1.0401 0.0778 0.6631 1.0899 1.6600 0.9446 0.2332 0.4780 0.8177 0.1183 1.1855 1.2802 0.3559 3.4258 0.5721 0.3790 5.1495 19.5709 1.3908 39.2078 6.0575 89.7253 8.5826 47.8269 2.7717 20.0775 2.7174 29.6264 11.7000 78.6658 0.9250 41.6554 27.7475 7.5521 43.0370 0.9317 10.2376 4.3666 4.3391 28.4403 10.0642 0.7760 0.8402 2.2444 8.0958 28.3541 173.4476 79.6237 0.4589 33.5226 119.4475 0.7535 0.8846 11.5307 0.5183 3.5226 0.0098 513.2692 0.3702 1.4762 0.1378 96.0925 0.5915 0.1910 1.6691 31.1745 5.0891 0.0271 1.3267 11.0198 1.0278 5.6488 0.0174 0.0136 1.2534 0.5220 12.5101 12.0246 57.5034 0.4069 29.3758 335.7146 98.6495 106.5246 134.4392 1.4319 0.1949 15.1096 116.7380 37.2987 0.3494 15.4927 0.9839 42.3999 0.2442 52.5790 35.4550 82.2800 53.5219 85.2894 12.9390 7.1490 3.1326 126.1323 62.2247
temp: 298.150 k
press: 1.00000 atm
elementType: 17 8 8 7 6 6 6 6 6 6 6 6 6 6 6 6 6 6 1 1 1 1 1 1 1 1 1 1 1 1 1 1 1 1 1 1 1 1
symmnumber: 1
zpe: 825636.4 jmol-1
zpe.correction: 0.314468 hartree
zpe.thermalcorrener: 0.334367 hartree
zpe.thermalcorrenthalpy: 0.335311 hartree
zpe.thermalcorrgfe: 0.262646 hartree
zpe.sumelectzpe: -1209.396900 hartree
zpe.sumelectthermal: -1209.377001 hartree
zpe.sumelectthermalent: -1209.376057 hartree
zpe.sumelectthermalfe: -1209.448722 hartree
dipole: -0.3010 -2.2248 -0.0411
dipole: 2.2455
quadrupole: -94.6014 -118.8917 -117.7797
quadrupole: -14.3531 -0.4476 0.2635
quadrupole: 15.8229 -8.4674 -7.3554 -14.3531 -0.4476 0.2635
hfenergy: -1209.7113679 hartree
pointgroup: C01[X(C14H20Cl1N1O2)]
dipole: 0.0823159 -0.8791889 -0.0264987 debye
polarizability: 247.1710815|-5.0206999|205.0648963|-3.5012784|4.6536747|100.8267333 unknown
InChI: InChI=1S/C14H20ClNO2/c1-2-3-4-5-6-9-18-14(17)12-10-11(15)7-8-13(12)16/h7-8,10H,2-6,9,16H2,1H3
charge 0 multiplicity 1
38 atoms
Cl -3.786631 3.620581 0.27955
O  -0.252402 -0.292854 0.035055
O  -1.2935 -2.370854 -0.032967
N  -3.973671 -2.420557 0.053588
C  4.685686 0.508787 0.089398
C  3.564912 -0.547466 -0.03793
C  6.104782 -0.091806 -0.02497
C  2.149604 0.06947 0.0590
C  7.226431 0.963354 0.110047
C  1.061246 -0.998761 -0.038627
C  8.641305 0.356931 -0.009663
C  -1.385347 -1.103185 0.027352
C  -2.647221 -0.344106 0.095465
C  -3.91078 -1.043956 0.105838
C  -2.625414 1.079637 0.1497
C  -5.112187 -0.266729 0.172656
C  -3.82194 1.794535 0.212813
C  -5.073894 1.132718 0.225408
H  4.551012 1.282553 -0.694938
H  4.586085 1.032385 1.062988
H  3.673061 -1.079736 -1.005892
H  3.693449 -1.313085 0.755481
H  6.23977 -0.869884 0.755465
H  6.207631 -0.610351 -1.001294
H  2.040536 0.613182 1.01712
H  2.006761 0.810605 -0.750843
H  7.089444 1.741778 -0.66827
H  7.124964 1.479564 1.086541
H  1.104549 -1.555675 -0.993289
H  1.114044 -1.730239 0.788843
H  8.816463 -0.399923 0.778213
H  9.424176 1.131622 0.086273
H  8.777071 -0.141424 -0.98823
H  -1.659684 1.589557 0.140035
H  -6.079925 -0.781312 0.182046
H  -6.001801 1.710428 0.275503
H  -4.871936 -2.896302 0.062505
H  -3.089048 -2.940482 0.002933
