program: Gaussian 09
title: 000140343
version: EM64L-G09RevD.01
frameworkgroup: C1[X(C4H12Si)]
method: RPBEPBE
basis: SDD
operation: Freq
keyword: #pfreq=noraman
keyword: PBEPBE/SDD
title: #p freq=noraman PBEPBE/SDD
converged: NO YES NO NO
title: Mulliken charges:
elementType: Si C C C C H H H H H H H H H H H H
charge: 0.438459 -0.193011 -0.658860 -0.658766 -0.658895 -0.069105 -0.069151 -0.069131 0.217117 0.211881 0.217131 0.217135 0.217145 0.211849 0.217161 0.211909 0.217133
chargesum: 0.00000
title: Mulliken charges with hydrogens summed into heavy atoms:
elementType: Si C C C C
charge: 0.231073 -0.193011 -0.012731 -0.012638 -0.012693
polarizability: 7.37437584e+01 5.13849306e-03 6.53093449e+01 -8.82338843e-03 1.42826243e-03 6.53096721e+01
1716.lowfreq: -18.3980 -13.2720 0.0021 0.0026 0.0028 19.3787 126.7700 208.6608 210.9218
frequency: 126.7454 208.6432 210.9070 214.3092 260.7183 266.2265 332.2472 354.3716 358.5576 564.0135 596.5579 598.6520 819.1089 857.6914 906.3559 907.3745 938.6081 939.7241 944.7303 1012.9146 1014.1385 1198.9363 1202.2438 1203.4923 1373.9985 1374.9741 1401.2020 1461.1333 1463.5666 1463.9059 1482.4164 1482.6491 1489.2263 2101.1526 2120.8910 2121.6577 2949.9013 2950.3059 2954.9649 3039.8273 3040.3270 3046.5721 3058.0649 3064.2814 3064.7928
redmass: 1.0338 1.0550 1.9733 1.9666 1.0986 1.1027 2.9015 2.0475 2.0444 3.0190 1.3015 1.2965 2.6850 1.1135 1.0451 1.0445 1.6606 1.6663 1.2039 1.3879 1.3856 2.2281 2.8269 2.8435 1.1875 1.1882 1.1962 1.0491 1.0476 1.0480 1.0487 1.0487 1.0523 1.0197 1.0504 1.0504 1.0360 1.0361 1.0366 1.0979 1.0978 1.0960 1.1008 1.0993 1.0993
irintensity: 0.0023 0.0155 0.2401 0.2068 0.0026 0.0030 0.2140 0.1525 0.1579 0.1759 26.3991 26.2943 15.3460 194.0858 34.7234 34.6835 2.2667 2.0963 0.0260 2.1870 2.1544 11.9392 0.9810 1.0209 20.2994 20.5052 4.6094 0.0048 1.6045 1.8686 16.4250 16.5257 24.2087 78.6380 104.1765 104.1717 40.3706 39.9589 46.3377 10.5805 10.5119 94.2831 0.2673 50.2212 49.8635
temp: 298.150 k
press: 1.00000 atm
elementType: 14 6 6 6 6 1 1 1 1 1 1 1 1 1 1 1 1
symmnumber: 1
zpe: 374090.7 jmol-1
zpe.correction: 0.142484 hartree
zpe.thermalcorrener: 0.150718 hartree
zpe.thermalcorrenthalpy: 0.151662 hartree
zpe.thermalcorrgfe: 0.111364 hartree
zpe.sumelectzpe: -448.541754 hartree
zpe.sumelectthermal: -448.533520 hartree
zpe.sumelectthermalent: -448.532575 hartree
zpe.sumelectthermalfe: -448.572874 hartree
dipole: -0.8564 0.0001 -0.0007
dipole: 0.8564
quadrupole: -44.1155 -43.0051 -43.0039
quadrupole: -0.0002 -0.0029 0.0007
quadrupole: -0.7406 0.3697 0.3709 -0.0002 -0.0029 0.0007
hfenergy: -448.6842372 hartree
pointgroup: C01 [X(C4H12Si1)]
dipole: -0.3369188 -0.0002575 0.0001234 debye
dipolederiv: 1.0089465 0.0001408 -0.0000115 0.0002353 0.7819212 0.0000161 -0.0000414 -0.000031 0.7820032 0.0541908 0.0000062 0.0001153 0.0001378 -0.1316459 -0.0002031 0.0001326 -0.0001278 -0.1312787 0.0047238 -0.0716753 0.0546808 0.0452803 -0.0064712 0.0232944 -0.0345985 0.0230543 0.0064572 0.0044738 0.0833831 0.0348337 -0.0522876 -0.0166984 -0.0171195 -0.0219348 -0.0172721 0.0168501 0.0044888 -0.0116406 -0.0894016 0.007484 0.0232366 -0.005833 0.0565685 -0.0056141 -0.0234223 -0.2807386 -0.0259707 0.0196795 -0.0504376 -0.2276301 0.0423825 0.0384686 0.0425065 -0.2047693 -0.2810848 0.0301465 0.0125708 0.0585023 -0.2470532 -0.0311 0.0243339 -0.0310286 -0.1852169 -0.280956 -0.0041407 -0.0323418 -0.0082266 -0.1737808 -0.0114118 -0.0627238 -0.0112215 -0.2585076 0.0722557 -0.0081287 -0.0905485 -0.0196385 0.082347 -0.0382902 -0.0537708 0.012003 -0.1572581 -0.2224316 -0.0526296 0.0397265 0.0021877 0.0674112 0.023723 -0.0020243 0.023568 0.0805604 0.0720808 0.0855739 0.0319578 0.0468875 -0.1330633 -0.0475793 0.0333075 -0.0978092 0.0585893 0.0721875 -0.0746216 0.0523799 -0.0370347 -0.0859527 0.0850538 0.0439077 0.135293 0.0112555 0.0723252 -0.0149139 -0.0896057 0.0053428 0.0737047 -0.0215371 -0.0568535 -0.0717996 -0.1485016 -0.2223405 0.0606094 0.0251967 -0.0030413 0.0568359 -0.0175105 -0.0016332 -0.0174142 0.0912266 0.0724321 0.0823861 0.0380772 0.0563026 -0.108999 -0.1221747 0.0098704 -0.0718594 0.0340882 -0.2223966 -0.0078208 -0.0657903 0.0010225 0.0977438 -0.0061227 0.0026736 -0.0064075 0.0501692 0.0718432 -0.0707041 0.0584812 -0.0527165 -0.0519059 0.144412 0.0243176 0.0941602 -0.0222451 unknown
polarizability: 73.7437381|0.0097966|65.3107873|0.0133762|0.0006931|65.3082499 unknown
InChI: InChI=1S/C4H12Si/c1-4(2,3)5/h1-3,5H3
charge 0 multiplicity 1
17 atoms
Si 1.856863 0.001554 0.001079
C  -0.08638 -0.000226 0.000069
C  -0.603001 -1.166462 0.887234
C  -0.604405 1.351076 0.565646
C  -0.601852 -0.186232 -1.453748
H  2.382836 1.126201 -0.860317
H  2.385445 -1.305658 -0.541839
H  2.383952 0.185919 1.405167
H  -0.263238 -1.065051 1.935659
H  -1.712362 -1.175323 0.892838
H  -0.26133 -2.149443 0.510403
H  -0.263552 2.208646 -0.045435
H  -0.264771 1.516226 1.605975
H  -1.713769 1.359269 0.568085
H  -0.263136 -1.145843 -1.888986
H  -1.711252 -0.184821 -1.46572
H  -0.258048 0.630569 -2.116707
