program: Gaussian 09
title: 000011357
version: EM64L-G09RevD.01
frameworkgroup: C1[X(C8H11N)]
method: RPBEPBE
basis: SDD
operation: Freq
keyword: #pfreq=noraman
keyword: PBEPBE/SDD
title: #p freq=noraman PBEPBE/SDD
converged: YES YES NO NO
title: Mulliken charges:
elementType: N C C C C C C C C H H H H H H H H H H H
charge: -0.700616 0.381048 -0.552286 0.292596 -0.400949 -0.677202 -0.413201 -0.273284 -0.217127 0.223384 0.192008 0.222367 0.218290 0.213465 0.230023 0.208468 0.221009 0.218177 0.313300 0.300531
chargesum: 0.00000
title: Mulliken charges with hydrogens summed into heavy atoms:
elementType: N C C C C C C C C
charge: -0.086784 0.381048 -0.136895 0.292596 -0.178583 -0.015425 -0.204732 -0.052275 0.001050
polarizability: 1.16038211e+02 5.38187951e+00 1.03536634e+02 -6.94298846e+00 2.15564040e+00 5.20370435e+01
1716.lowfreq: -7.0873 0.0001 0.0002 0.0005 5.2954 14.4523 96.5263 121.6400 198.9802
frequency: 96.4820 121.5594 198.9717 214.2985 293.0899 316.4613 343.2076 377.9572 409.4898 464.7598 516.0532 559.6659 583.4774 719.1760 739.6625 751.4744 785.1176 838.4940 846.2437 928.8401 963.0270 964.1494 1004.4493 1024.6127 1060.2730 1065.9635 1139.8334 1170.2863 1200.7914 1237.6452 1295.8449 1310.9218 1318.3375 1390.5760 1393.8126 1448.9331 1472.8734 1478.1991 1494.6651 1501.0912 1590.7388 1618.2299 1640.0705 2956.2874 2980.1211 3029.1874 3074.5481 3084.2932 3108.9388 3113.3225 3135.4360 3160.8064 3574.7189 3714.9824
redmass: 2.6411 2.9630 1.2885 2.4834 1.1966 2.4059 2.6518 1.1105 2.6025 3.0596 3.8305 4.1996 4.5212 3.8188 2.1029 1.6370 1.2719 3.3496 1.4881 1.3736 1.3462 2.3110 1.7218 1.8017 1.9520 1.5545 1.3481 1.0520 2.4489 1.3194 1.4776 2.2037 1.4428 1.8888 2.1911 2.4884 1.0507 1.1430 1.1122 2.4599 6.5672 3.8236 1.3252 1.0663 1.0356 1.0943 1.0997 1.1003 1.0862 1.0892 1.0925 1.1001 1.0449 1.1034
irintensity: 0.3222 0.5808 0.1227 1.3017 261.2300 11.3015 2.0089 19.5689 1.3390 8.2664 2.9196 0.0369 0.3980 2.6128 21.1773 75.4862 1.4142 8.7803 1.9497 3.0242 0.4110 8.2864 0.9025 4.0579 25.6706 3.6541 13.4453 2.6891 0.2554 0.6882 2.9579 36.6943 2.8945 6.3980 14.9763 24.9148 13.1506 3.3262 15.9318 68.9628 10.7389 9.2539 201.6679 48.5376 43.1569 12.1307 53.9174 33.6376 24.2285 5.8674 34.4087 27.4442 43.3115 19.2561
temp: 298.150 k
press: 1.00000 atm
elementType: 7 6 6 6 6 6 6 6 6 1 1 1 1 1 1 1 1 1 1 1
symmnumber: 1
zpe: 447537.6 jmol-1
zpe.correction: 0.170458 hartree
zpe.thermalcorrener: 0.179402 hartree
zpe.thermalcorrenthalpy: 0.180347 hartree
zpe.thermalcorrgfe: 0.137257 hartree
zpe.sumelectzpe: -365.535761 hartree
zpe.sumelectthermal: -365.526817 hartree
zpe.sumelectthermalent: -365.525872 hartree
zpe.sumelectthermalfe: -365.568962 hartree
dipole: 1.5024 1.5281 -0.1860
dipole: 2.1510
quadrupole: -50.0219 -45.3008 -59.6633
quadrupole: 0.7316 -2.2963 0.1540
quadrupole: 1.6401 6.3612 -8.0013 0.7316 -2.2963 0.1540
hfenergy: -365.706219 hartree
pointgroup: C01 [X(C8H11N1)]
dipole: 0.5742385 -0.6210771 0.0266795 debye
dipolederiv: -0.5618347 0.5831558 0.0939518 0.5556221 -0.9924197 0.066949 0.1432483 0.0615741 -0.687156 0.1449373 -0.0377419 0.0202856 0.3568402 -0.2972436 0.0281343 0.0895971 -0.0383659 -0.1420937 0.0653152 0.0231075 0.0262443 0.0226974 0.1416187 -0.0292136 0.0937569 0.0009755 0.1406402 0.3712642 -0.6786777 -0.0230067 -0.6998231 0.9321894 -0.0235716 -0.048722 -0.0281854 0.1067378 0.1764098 -0.0043866 0.0659687 -0.1151071 0.1238966 0.0230592 0.0457048 0.0343883 -0.1365703 -0.0081471 -0.0136351 0.0444523 -0.0120468 0.0609333 0.0093835 -0.0163512 -0.0194603 -0.0180074 -0.1745506 0.4019699 0.0533318 -0.0147367 -0.0621738 0.0223052 0.0040258 0.1010989 -0.2169208 -0.2463695 -0.0757635 -0.0023363 -0.1220713 -0.1273771 0.0026905 -0.022817 0.003063 -0.2218722 0.0803189 -0.0769692 0.0419368 0.11464 0.2099406 0.0565527 0.058787 0.0362931 -0.130508 0.0372424 0.0017114 0.0123474 -0.0761437 -0.1019683 -0.1318376 -0.0067647 -0.0766743 0.0089963 -0.0382352 0.0256805 -0.0398831 0.0927406 -0.0462628 0.1610581 -0.0444656 0.089657 -0.0520339 0.0464657 -0.105776 -0.0383959 -0.0778843 -0.0866499 -0.0428622 -0.0301773 -0.0504207 0.1257813 0.1094773 -0.0458274 -0.0206281 0.0059358 -0.0903194 -0.1265634 -0.014798 -0.0731313 0.0134245 -0.2646165 -0.0391274 -0.0160857 -0.0255244 0.1004385 -0.0036374 -0.0228719 0.0008923 0.0599144 0.0842489 0.075884 -0.0380234 0.0193434 -0.0420504 0.1249903 -0.0030399 0.0850493 -0.0168479 0.0452594 -0.045746 -0.0248305 -0.0812432 -0.1354098 -0.0510878 -0.0331572 -0.049117 0.1538342 -0.0066093 0.1049427 -0.0148508 0.1170542 -0.0617685 -0.0143283 -0.0174856 -0.016905 0.1711417 -0.1416774 -0.0208966 -0.0542137 -0.0284174 0.0881676 -0.0141373 -0.0569601 -0.0131703 0.1434039 0.1463057 -0.028732 -0.044593 0.0003488 0.2048375 -0.0329886 -0.0655521 -0.0319084 0.3371523 0.1347953 -0.0431725 -0.0416716 -0.0322246 0.1816211 -0.024895 -0.0519574 -0.0156528 0.3609837 unknown
polarizability: 115.839735|-6.1298933|103.3577572|6.0334543|5.4448367|52.4143966 unknown
InChI: InChI=1S/C8H11N/c1-2-7-5-3-4-6-8(7)9/h3-6H,2,9H2,1H3
charge 0 multiplicity 1
20 atoms
N  0.724315 -2.088958 0.018857
C  0.469983 0.34841 0.295342
C  1.961127 0.524383 0.550563
C  -0.084965 -0.945455 0.022405
C  -0.396901 1.465626 0.294573
C  2.813735 0.481629 -0.749159
C  -1.478897 -1.06831 -0.243201
C  -1.780765 1.345939 0.029137
C  -2.315856 0.065311 -0.240901
H  2.130968 1.496097 1.050621
H  2.331497 -0.245397 1.260742
H  0.027926 2.454751 0.509823
H  2.660358 -0.45974 -1.307879
H  3.891874 0.576916 -0.521777
H  2.528279 1.310501 -1.420772
H  -1.900987 -2.060144 -0.451176
H  -2.426355 2.23024 0.037608
H  -3.385612 -0.053437 -0.448833
H  1.715979 -2.035263 0.224437
H  0.314797 -3.004897 -0.137312
