program: Gaussian 09
title: 000142015
version: EM64L-G09RevD.01
frameworkgroup: C1[X(C5H11ClO2)]
method: RPBEPBE
basis: SDD
operation: Freq
keyword: #p
keyword: freq=noraman
keyword: PBEPBE/SDD
title: #p freq=noraman PBEPBE/SDD
converged: YES YES NO NO
title: Mulliken charges:
elementType: Cl O O C C C C C H H H H H H H H H H H
charge: -0.098725 -0.274166 -0.273137 0.092240 -0.387855 -0.574785 -0.503988 -0.516324 0.180812 0.230467 0.241915 0.266298 0.292495 0.231647 0.240875 0.200258 0.238175 0.209643 0.204154
chargesum: 0.00000
title: Mulliken charges with hydrogens summed into heavy atoms:
elementType: Cl O O C C C C C
charge: -0.098725 -0.274166 -0.273137 0.273052 0.084527 -0.015991 0.168792 0.135649
polarizability: 7.35385958e+01 3.85992365e-02 6.94063585e+01 -2.36239798e+00 1.98386916e+00 6.61273304e+01
1716.lowfreq: -7.2531 -0.0015 -0.0001 0.0007 5.5105 13.2459 41.1517 56.7820 79.4530
frequency: 41.1044 56.7608 79.4441 128.6759 161.1218 171.5848 196.7483 268.0094 295.9076 316.8708 466.9653 493.9465 505.3441 593.1127 770.1315 865.6186 918.9381 974.6886 1010.9039 1018.4049 1063.8116 1111.8146 1113.8047 1116.5924 1131.8110 1149.1905 1175.0653 1224.3288 1287.5627 1318.6576 1347.4906 1368.6525 1425.6431 1429.2488 1437.7235 1445.5258 1455.8604 1461.1288 1475.5556 1481.8162 2897.3675 2935.1274 2952.9725 3002.7762 3011.8759 3058.6217 3064.9048 3074.2717 3105.2436 3120.0296 3155.5879
redmass: 4.6255 2.6379 4.3681 2.1855 1.1314 1.3653 2.7150 2.8509 2.9066 3.3033 3.4734 2.9121 4.5431 5.0142 1.9076 2.9219 3.3484 2.4388 2.4545 6.3174 2.4537 1.3020 1.2914 2.3903 1.1575 1.4155 1.5546 1.4016 1.2076 1.1725 1.2010 1.5904 1.1196 1.1162 1.1316 1.1013 1.0528 1.0599 1.0529 1.0524 1.0837 1.0342 1.0378 1.0612 1.1026 1.0952 1.0691 1.0873 1.0976 1.1020 1.1113
irintensity: 2.4257 4.7537 5.4816 6.9720 0.1051 3.6460 3.3888 4.4725 6.7935 3.5200 20.8414 3.6819 3.0582 24.8569 8.6984 56.9261 24.7499 30.6471 19.5097 179.3981 70.1497 2.4060 4.9435 40.6947 6.2546 12.8184 12.4631 3.8113 16.1297 3.9037 25.1841 20.7582 19.6448 1.5900 8.2980 11.3175 9.8667 10.2860 12.2828 14.6098 41.1628 70.7394 64.6760 7.3108 70.4495 45.3366 12.3196 25.6251 28.4079 23.7968 9.0859
temp: 298.150 k
press: 1.00000 atm
elementType: 17 8 8 6 6 6 6 6 1 1 1 1 1 1 1 1 1 1 1
symmnumber: 1
zpe: 411122.7 jmol-1
zpe.correction: 0.156588 hartree
zpe.thermalcorrener: 0.167070 hartree
zpe.thermalcorrenthalpy: 0.168014 hartree
zpe.thermalcorrgfe: 0.119290 hartree
zpe.sumelectzpe: -806.927101 hartree
zpe.sumelectthermal: -806.916620 hartree
zpe.sumelectthermalent: -806.915676 hartree
zpe.sumelectthermalfe: -806.964400 hartree
dipole: -1.1817 -0.6900 -0.4142
dipole: 1.4297
quadrupole: -60.6205 -51.6529 -54.7898
quadrupole: 0.9354 8.9655 -0.7292
quadrupole: -4.9328 4.0349 0.8979 0.9354 8.9655 -0.7292
hfenergy: -807.0836898 hartree
pointgroup: C01 [X(C5H11Cl1O2)]
dipole: 0.4848721 0.2412085 -0.1520127 debye
dipolederiv: -0.3711253 -0.0070189 -0.1318254 0.0222013 -0.2074099 0.0498931 -0.2310507 0.0122762 -0.4909594 -0.6594754 0.2491749 0.079913 0.2066855 -1.0515046 -0.09289 0.0628865 -0.0415971 -0.4238642 -0.7706405 -0.442032 0.1777185 -0.2473822 -0.9127306 0.1281605 0.079399 0.062867 -0.4521914 0.9227239 0.3013014 -0.0982522 -0.030639 1.2604367 -0.007273 0.0124783 -0.018821 0.4614335 -0.1759375 -0.0216708 0.0183082 0.0180625 -0.0530872 -0.0212261 -0.0314482 -0.0587151 -0.0911979 0.3678013 -0.0503057 0.2509894 0.0061599 0.1680442 -0.0472356 0.3343511 -0.0519766 0.6174619 0.4136005 -0.220283 -0.0449233 -0.1146726 0.4002367 0.0805838 -0.0858205 0.2245791 0.3558146 0.2595183 0.0280489 -0.0662942 0.1450788 0.5571337 -0.1166624 -0.1683322 -0.2043566 0.400109 0.0036382 -0.0389798 -0.0014114 0.0240187 -0.0546713 0.0047168 -0.0611425 0.0361495 -0.196426 0.0499636 0.020739 0.0075079 0.0154601 -0.1249884 0.0037636 0.0279729 0.0475966 0.1072366 0.0327371 0.0002578 -0.0968469 -0.0385149 0.1197187 0.0281993 -0.0165087 0.0215586 -0.0611509 -0.0899816 0.0345477 0.0506713 0.0576295 0.0832275 -0.0289894 0.04619 -0.0110938 -0.0836582 0.1191036 0.0201654 -0.0623652 -0.0261457 -0.0597662 0.0214371 -0.065743 0.0216682 -0.0016123 0.0911129 0.0131088 0.0201135 0.0513883 -0.1444006 0.0502122 0.0148048 0.0718374 0.0751113 -0.1494359 0.0001748 0.0143393 -0.099823 0.0708972 -0.0188923 0.012222 -0.057335 0.0629868 0.0082982 0.0460013 -0.0789646 0.0350149 0.0630396 0.0298781 -0.0078794 -0.0882975 -0.1989166 -0.1049941 -0.1202847 -0.0255207 -0.0880899 0.0322408 0.0059501 -0.0433525 -0.0002697 0.0941611 -0.0338144 0.1839954 0.0203859 0.0865776 -0.1394867 0.0174523 0.0608292 0.0216306 0.0348322 0.0869071 0.0030593 -0.0335432 -0.0230098 -0.0069298 -0.087078 0.0601438 0.0122991 -0.2091703 unknown
polarizability: 73.1906292|0.2662661|69.0234196|2.7548451|-2.3003585|66.8582359 unknown
InChI: InChI=1S/C5H11ClO2/c1-7-5(8-2)3-4-6/h5H,3-4H2,1-2H3
charge 0 multiplicity 1
19 atoms
Cl -2.859748 0.294967 -1.012016
O  0.5042 -1.274329 0.444105
O  1.539646 0.844793 0.328214
C  0.296345 0.097481 0.068204
C  -0.842222 0.627865 0.947903
C  -2.172946 -0.083842 0.726155
C  1.501754 -1.965514 -0.384904
C  1.749199 1.970916 -0.584973
H  0.049591 0.177274 -1.019114
H  -0.954628 1.715366 0.789652
H  -0.53531 0.471898 2.00099
H  -2.958105 0.265177 1.412252
H  -2.06613 -1.176826 0.760311
H  1.532712 -3.001955 -0.016058
H  2.493045 -1.49135 -0.274765
H  1.200274 -1.958904 -1.453346
H  2.745176 2.374332 -0.343792
H  0.99231 2.769616 -0.442737
H  1.729836 1.646334 -1.64688
