program: Gaussian 09
title: 000141984
version: EM64L-G09RevD.01
frameworkgroup: C1[X(C20H24)]
method: RPBEPBE
basis: SDD
operation: Freq
keyword: #p
keyword: freq=noraman
keyword: PBEPBE/SDD
title: #p freq=noraman PBEPBE/SDD
converged: YES YES NO NO
title: Mulliken charges:
elementType: C C C C C C C C C C C C C C C C C C C C H H H H H H H H H H H H H H H H H H H H H H H H
charge: -0.603309 -0.603731 -0.603732 -0.603296 0.422868 0.422995 0.423044 0.422899 0.330992 0.332308 0.332294 0.330946 -0.629362 -0.631078 -0.631062 -0.629399 -0.861938 -0.862708 -0.862712 -0.861925 0.214478 0.217510 0.214737 0.217874 0.217864 0.214736 0.217508 0.214472 0.226596 0.226764 0.226763 0.226600 0.228834 0.229180 0.224244 0.229125 0.229377 0.224245 0.229377 0.224251 0.229123 0.229178 0.228818 0.224252
chargesum: 0.00000
title: Mulliken charges with hydrogens summed into heavy atoms:
elementType: C C C C C C C C C C C C C C C C C C C C
charge: -0.171321 -0.171121 -0.171132 -0.171316 0.422868 0.422995 0.423044 0.422899 0.330992 0.332308 0.332294 0.330946 -0.402766 -0.404314 -0.404299 -0.402798 -0.179680 -0.179960 -0.179961 -0.179677
polarizability: 2.34415463e+02 1.22744807e-03 2.14127189e+02 9.79612479e-04 -2.80817561e-03 1.46388953e+02
1716.lowfreq: -6.1082 -0.0003 0.0004 0.0010 18.9091 27.5997 77.0471 87.1250 102.7442
frequency: 77.0422 87.1207 102.6989 111.2697 111.6283 113.5250 114.1442 133.5237 153.5957 158.2531 237.3702 239.2614 265.3432 277.0580 277.1099 287.7073 292.2143 301.5289 337.5878 340.4628 405.8506 422.0069 440.2541 454.9740 466.9110 500.3637 511.8150 514.8092 530.3635 554.2963 637.9023 638.1158 689.4048 693.7771 722.0822 727.0148 747.8056 753.1858 760.4904 765.9634 818.9170 845.5171 851.5087 858.7437 889.4412 892.6640 895.6672 903.3026 961.6991 973.1706 990.2976 997.0173 1011.1075 1023.7445 1033.0637 1038.5891 1040.0753 1044.7433 1062.9601 1075.6563 1117.6233 1162.6401 1174.7985 1178.0290 1182.1283 1195.3129 1209.0056 1209.6901 1254.8940 1262.3625 1265.8287 1280.2430 1285.2147 1288.2977 1300.8549 1318.7907 1356.4420 1358.1346 1384.1820 1389.6970 1392.0159 1392.7804 1395.8805 1400.5621 1459.3977 1460.2634 1460.8624 1462.3963 1463.8869 1469.4141 1472.6251 1476.8047 1477.4407 1479.3104 1485.1154 1485.5940 1501.6257 1501.9804 1566.7543 1568.6937 1612.6641 1612.8495 2964.1074 2964.5623 2964.7600 2965.2359 2986.6540 2986.8211 2998.6890 2999.8613 3036.7282 3036.7668 3039.9245 3040.1180 3040.3739 3040.7207 3059.9181 3060.1264 3075.0944 3075.2366 3075.6884 3075.7612 3091.5934 3092.4289 3096.6470 3097.5822
redmass: 2.7315 3.6562 1.2931 1.1512 1.0431 2.0017 1.0194 2.9233 2.9256 3.7125 1.9265 3.3464 2.3967 2.7130 2.5669 2.4466 2.5868 2.9525 4.2679 3.0482 5.3735 4.3443 3.2470 2.8480 3.3802 4.6963 2.3581 2.7532 3.9250 4.4338 5.3576 4.0707 3.6479 4.8711 3.5104 5.7745 2.7576 1.7561 3.5542 2.6579 1.4914 3.0878 1.6907 1.5713 1.6581 1.8379 3.0237 1.6537 1.9364 1.5763 1.5293 1.5691 1.4433 1.7979 1.5302 1.5730 1.5709 1.5362 3.4407 3.8588 1.6207 1.1107 1.4978 2.6885 1.1811 1.4982 1.8653 1.4176 1.1981 1.1962 2.7582 1.2629 3.5304 1.3107 1.4908 1.9876 5.0796 5.9297 2.0216 1.3678 1.2206 1.2226 1.8087 3.1057 1.0829 1.1199 1.0808 1.0675 1.0811 1.0736 1.0542 1.0830 1.1406 1.1742 1.2187 1.1088 2.4352 2.6825 6.5171 6.4771 6.5665 6.5644 1.0382 1.0382 1.0381 1.0382 1.0584 1.0585 1.0601 1.0601 1.1023 1.1025 1.0955 1.0956 1.0960 1.0958 1.1043 1.1041 1.0984 1.0987 1.0983 1.0985 1.0899 1.0899 1.0906 1.0907
irintensity: 0.0000 0.0045 0.1761 0.4080 0.0374 0.1054 0.2172 0.0002 4.3397 0.1245 0.0316 0.0000 0.0001 0.3468 0.0616 1.6565 0.0365 0.5982 5.2658 0.2718 2.6258 0.0000 4.7148 0.0050 10.5785 0.0009 10.3965 0.0099 0.3844 0.6575 0.0001 1.0105 2.2271 0.2588 17.6299 0.0000 0.0803 0.7415 1.4444 0.1021 3.9188 0.0007 1.8766 3.0501 0.0566 0.3258 1.0296 63.2966 0.9481 0.0000 3.6717 19.9186 0.0345 0.0003 0.1223 28.7149 0.5069 0.0034 2.4576 0.0002 0.0251 0.0084 3.7052 1.0872 0.0000 0.4876 0.3613 2.7177 0.0000 3.9327 0.6169 1.2698 0.0003 0.0014 0.0220 1.2189 2.4865 0.7387 0.0848 32.2252 0.0002 0.0709 18.2050 16.7429 0.0021 9.5332 0.0216 16.0361 8.0094 5.6306 0.0579 35.2833 26.9470 15.1350 7.6961 0.0172 17.2429 10.0501 0.0022 1.0443 6.9876 5.0741 50.7386 101.5221 0.4635 0.0131 4.6774 39.0818 200.8105 0.0033 9.1373 0.1383 8.4722 100.0703 0.3101 1.7682 0.2894 68.8513 35.0985 1.8408 14.4690 0.0580 37.8011 66.6172 0.2494 0.0480
temp: 298.150 k
press: 1.00000 atm
elementType: 6 6 6 6 6 6 6 6 6 6 6 6 6 6 6 6 6 6 6 6 1 1 1 1 1 1 1 1 1 1 1 1 1 1 1 1 1 1 1 1 1 1 1 1
symmnumber: 1
zpe: 991717.4 jmol-1
zpe.correction: 0.377725 hartree
zpe.thermalcorrener: 0.396807 hartree
zpe.thermalcorrenthalpy: 0.397751 hartree
zpe.thermalcorrgfe: 0.333055 hartree
zpe.sumelectzpe: -775.048203 hartree
zpe.sumelectthermal: -775.029121 hartree
zpe.sumelectthermalent: -775.028177 hartree
zpe.sumelectthermalfe: -775.092873 hartree
dipole: 0.0000 0.0000 -0.0020
dipole: 0.0020
quadrupole: -111.1497 -111.0524 -131.9904
quadrupole: 0.0076 0.0003 -0.0012
quadrupole: 6.9144 7.0118 -13.9263 0.0076 0.0003 -0.0012
hfenergy: -775.4259283 hartree
pointgroup: C01 [X(C20H24)]
dipole: 0.0000137 -0.0007931 -0.0000163 debye
polarizability: 234.4120132|0.0689968|146.3890112|0.2624836|-0.0176964|214.1305803 unknown
InChI: InChI=1S/C20H24/c1-13-9-18-7-8-20-12-15(3)19(11-16(20)4)6-5-17(13)10-14(18)2/h9-12H,5-8H2,1-4H3
charge 0 multiplicity 1
44 atoms
C  2.818506 0.842837 -0.087848
C  -2.815353 -0.760187 -0.165435
C  2.816414 -0.75597 0.164972
C  -2.819846 0.838465 0.088319
C  1.422163 1.452223 -0.013117
C  -1.421032 -1.368963 -0.053362
C  1.423012 -1.366772 0.052607
C  -1.424439 1.449996 0.013999
C  0.739175 1.626467 1.226076
C  -0.772824 -1.542931 1.204334
C  0.775089 -1.541113 -1.205179
C  -0.741732 1.626038 -1.225085
C  0.673929 1.621038 -1.205777
C  -0.6405 -1.535932 -1.225302
C  0.642753 -1.535516 1.224462
C  -0.676476 1.619254 1.206766
C  1.48421 1.661096 2.548757
C  -1.555568 -1.577321 2.505093
C  1.557919 -1.573479 -2.505935
C  -1.486822 1.660214 -2.547744
H  3.510022 1.29049 0.650509
H  3.24687 1.034648 -1.089355
H  -3.52604 -1.208294 0.55421
H  -3.217075 -0.951774 -1.177958
H  3.218483 -0.947529 1.177363
H  3.527743 -1.20259 -0.554963
H  -3.248553 1.029017 1.089922
H  -3.51202 1.285497 -0.6498
H  1.207347 1.619899 -2.166336
H  -1.147251 -1.532515 -2.200076
H  1.149496 -1.531721 2.199235
H  -1.209889 1.616681 2.167322
H  2.289704 2.419026 2.544964
H  0.80007 1.900599 3.381423
H  1.957448 0.685917 2.778322
H  -0.892525 -1.795716 3.360297
H  -2.346833 -2.349995 2.485476
H  -2.053415 -0.608832 2.709289
H  2.350383 -2.344934 -2.486792
H  2.054278 -0.604084 -2.709459
H  0.895252 -1.792326 -3.361312
H  -0.80316 1.901791 -3.380204
H  -2.293882 2.416467 -2.543372
H  -1.95803 0.684234 -2.778103
