program: Gaussian 09
title: 000141947
version: EM64L-G09RevD.01
frameworkgroup: C1[X(C17H18)]
method: RPBEPBE
basis: SDD
operation: Freq
keyword: #p
keyword: freq=noraman
keyword: PBEPBE/SDD
title: #p freq=noraman PBEPBE/SDD
converged: YES YES NO NO
title: Mulliken charges:
elementType: C C C C C C C C C C C C C C C C C H H H H H H H H H H H H H H H H H H
charge: -0.332296 -0.448136 -0.377910 0.358071 -0.388654 -0.596233 0.352754 0.415321 -0.449111 -0.449296 -0.404186 -0.398628 -0.249528 -0.245649 -0.244297 -0.246979 -0.250075 0.216376 0.216140 0.193388 0.192077 0.213674 0.206673 0.200210 0.205422 0.230318 0.235917 0.233272 0.255160 0.230746 0.226261 0.224661 0.224289 0.223076 0.227168
chargesum: 0.00000
title: Mulliken charges with hydrogens summed into heavy atoms:
elementType: C C C C C C C C C C C C C C C C C
charge: -0.115920 -0.038607 0.027841 0.358071 0.018230 -0.160492 0.352754 0.415321 -0.213194 -0.216024 -0.149026 -0.167882 -0.023267 -0.020988 -0.020008 -0.023903 -0.022907
polarizability: 2.10786209e+02 -1.82148799e+01 1.58198341e+02 -6.56404496e-01 4.77720827e+00 1.44076490e+02
1716.lowfreq: -0.0008 -0.0007 -0.0001 4.7852 6.5189 19.4374 36.6458 61.0315 76.9143
frequency: 35.8962 61.0106 76.9067 112.1286 161.6090 186.1079 252.9949 255.5744 285.3083 309.1662 338.8088 363.8214 403.8208 428.7762 447.8408 466.8901 504.0500 550.2215 582.2332 592.5739 617.6151 661.7258 692.0078 706.6179 744.1510 758.8246 765.2118 788.0083 806.4611 817.4663 857.5430 864.8932 874.8379 911.5677 919.1363 941.5022 949.5156 964.8339 981.7402 986.8809 990.6150 996.7136 1028.0729 1030.9621 1057.2416 1064.7459 1084.5519 1104.4758 1119.0379 1134.6707 1172.1158 1172.9092 1176.7842 1186.6359 1196.2848 1214.6179 1220.7516 1238.0886 1252.5748 1275.1194 1281.4643 1314.6373 1331.3720 1338.7700 1349.3638 1358.2607 1361.9891 1375.1100 1384.1464 1433.3328 1438.6393 1462.4184 1465.6451 1471.0963 1477.7344 1482.9258 1489.9470 1587.4675 1588.3945 1608.3894 1612.4308 2942.5262 2965.2315 2972.3411 2975.0793 2980.2023 3017.8543 3023.3230 3032.9029 3038.6780 3110.0129 3114.9706 3117.8759 3124.7682 3135.2293 3138.2124 3146.1625 3158.0165 3161.3874
redmass: 3.7247 4.2493 4.4525 3.3236 2.9523 3.7271 2.9282 2.9223 4.7714 2.9499 4.0824 2.1140 2.8488 3.2628 2.1364 3.2920 3.3349 2.5994 3.4134 4.6892 6.3744 3.8767 4.2577 1.7624 2.0677 1.7244 2.0465 2.2046 3.0116 2.4009 1.2513 2.0046 1.3607 1.8952 1.7007 2.2534 1.4213 2.2697 1.3778 1.3302 6.1883 1.3087 2.5104 2.4574 2.0454 1.8880 1.7599 1.7768 2.4931 1.2966 1.0560 1.1589 1.2761 2.2299 1.1209 1.5698 1.7584 1.3560 1.3998 1.3094 1.4552 1.3606 1.4469 1.3862 1.3156 1.5587 1.5091 7.2084 3.6693 2.2171 2.3013 1.0942 1.0944 1.1819 1.1462 2.1221 2.0002 6.1209 6.4112 6.2447 6.0717 1.0800 1.0598 1.0612 1.0623 1.0640 1.0991 1.1014 1.0990 1.1016 1.0864 1.0889 1.0842 1.0871 1.0924 1.0920 1.0954 1.1006 1.1014
irintensity: 0.0017 0.0904 0.1594 0.4781 0.0668 1.2446 0.2441 0.7001 0.7870 0.3041 1.1291 0.3268 0.0354 0.0154 5.5141 7.1541 1.1661 5.9247 0.4962 3.4305 0.3906 6.7370 1.4621 50.2827 26.3609 47.1776 35.3515 4.2201 3.8436 10.4983 0.1275 1.3185 1.1430 1.8497 8.6490 5.5839 3.5768 6.5179 0.1615 0.0189 0.5774 0.1246 2.5052 15.1751 3.9034 3.6990 5.7856 4.9724 0.5488 1.2324 0.0661 0.5617 1.0539 0.0095 2.6515 2.2521 1.7270 1.3003 2.2889 0.8990 1.4581 4.0540 0.8466 3.3577 0.7549 0.1364 1.2946 1.5295 0.6849 6.8213 5.2529 7.5214 7.0189 26.5327 11.6013 18.2583 21.0308 0.4170 0.8441 4.5706 10.5805 11.3392 14.5438 52.1365 20.5978 53.4316 57.4213 30.7669 31.1092 94.3239 14.6108 3.1545 3.2907 0.9104 28.9379 23.1739 37.4537 38.4913 23.7949
temp: 298.150 k
press: 1.00000 atm
elementType: 6 6 6 6 6 6 6 6 6 6 6 6 6 6 6 6 6 1 1 1 1 1 1 1 1 1 1 1 1 1 1 1 1 1 1
symmnumber: 1
zpe: 784221.3 jmol-1
zpe.correction: 0.298694 hartree
zpe.thermalcorrener: 0.312390 hartree
zpe.thermalcorrenthalpy: 0.313334 hartree
zpe.thermalcorrgfe: 0.258116 hartree
zpe.sumelectzpe: -657.399717 hartree
zpe.sumelectthermal: -657.386021 hartree
zpe.sumelectthermalent: -657.385077 hartree
zpe.sumelectthermalfe: -657.440294 hartree
dipole: -0.0848 0.5786 0.0387
dipole: 0.5861
quadrupole: -96.1050 -98.7790 -97.8226
quadrupole: -3.0266 -1.1529 1.2652
quadrupole: 1.4639 -1.2101 -0.2537 -3.0266 -1.1529 1.2652
hfenergy: -657.6984109 hartree
pointgroup: C01 [X(C17H18)]
dipole: 0.0281656 -0.228015 0.0196756 debye
polarizability: 209.9270942|-19.3849863|158.8643783|0.9013571|-5.0735056|144.2695678 unknown
InChI: InChI=1S/C17H18/c1-2-8-14(9-3-1)16-12-6-4-10-15-11-5-7-13-17(15)16/h1-3,5,7-9,11,13,16H,4,6,10,12H2
charge 0 multiplicity 1
35 atoms
C  0.139999 -0.306932 1.177191
C  0.089215 -1.854132 1.411193
C  0.238633 -2.761435 0.167645
C  -1.164799 0.240279 0.584958
C  -0.886678 -2.637121 -0.883674
C  -0.9858 -1.230729 -1.537954
C  -1.685179 -0.187455 -0.675518
C  1.414525 0.178735 0.448849
C  -1.885661 1.208846 1.327976
C  -2.905491 0.370957 -1.134004
C  1.382991 1.294407 -0.427683
C  2.676081 -0.419887 0.713339
C  -3.101543 1.757108 0.861152
C  -3.616556 1.333311 -0.382589
C  2.563879 1.78895 -1.026271
C  3.859103 0.071529 0.118935
C  3.810088 1.180031 -0.757324
H  0.2086 0.129626 2.197311
H  -0.870301 -2.080098 1.917535
H  0.88457 -2.124487 2.134038
H  0.286883 -3.813124 0.515491
H  1.208583 -2.552096 -0.32595
H  -1.863216 -2.900958 -0.430347
H  -0.695277 -3.380644 -1.683219
H  -1.535671 -1.320198 -2.493819
H  0.038809 -0.893109 -1.793954
H  -1.480656 1.540705 2.292557
H  -3.304025 0.040904 -2.101662
H  0.425129 1.780669 -0.642358
H  2.742272 -1.27718 1.39299
H  -3.635241 2.503484 1.460004
H  -4.55769 1.744987 -0.764459
H  2.509033 2.652329 -1.699576
H  4.818479 -0.410241 0.341139
H  4.726911 1.562566 -1.219841
