program: Gaussian 09
title: 000141922
version: EM64L-G09RevD.01
frameworkgroup: C1[X(C9H12S)]
method: RPBEPBE
basis: SDD
operation: Freq
keyword: #pfreq=noraman
keyword: PBEPBE/SDD
title: #p freq=noraman PBEPBE/SDD
converged: YES YES NO NO
title: Mulliken charges:
elementType: S C C C C C C C C C H H H H H H H H H H H H
charge: 0.158264 0.455007 -0.167175 -0.384034 -0.391064 -0.277416 -0.591922 -0.201244 -0.806189 -0.646866 0.252329 0.232191 0.256320 0.255725 0.261022 0.227114 0.225484 0.238346 0.224416 0.229633 0.228943 0.221116
chargesum: 0.00000
title: Mulliken charges with hydrogens summed into heavy atoms:
elementType: S C C C C C C C C C
charge: 0.158264 0.455007 -0.167175 -0.131704 -0.158874 -0.021097 -0.075175 0.025870 -0.117943 0.032825
polarizability: 1.56599087e+02 2.06057247e+00 1.11510239e+02 4.27880485e+00 3.08161280e+00 7.22339945e+01
1716.lowfreq: -12.0233 -9.8089 -5.3466 -0.0028 -0.0027 -0.0010 12.0688 37.5280 40.1133
frequency: 11.6814 37.2482 40.0836 75.8791 197.3163 212.0078 224.4871 236.6833 274.6454 368.2827 414.4279 442.4790 512.7571 534.5061 617.5249 669.7350 697.5569 782.2757 791.8417 837.8000 897.4531 919.2694 983.0762 985.0514 989.7354 993.2869 1024.7990 1047.2177 1065.1944 1073.9861 1100.6884 1176.4749 1218.9404 1231.3140 1268.1272 1289.2728 1369.8103 1393.6506 1396.4674 1404.1556 1458.8096 1461.5197 1468.9484 1473.1069 1474.7071 1483.4471 1579.1330 1602.7983 2976.3486 2984.4404 3023.0442 3058.0046 3077.4814 3078.9270 3085.5581 3106.1328 3120.0570 3128.9152 3141.2972 3163.2574
redmass: 3.8779 1.0318 1.8222 3.7205 3.7827 3.3757 2.8198 1.2924 3.6431 2.9403 5.8706 3.2755 4.9660 4.1015 4.4017 6.8965 2.3062 1.1125 1.3750 4.9898 1.3079 1.3723 1.6217 2.3182 1.8341 1.7552 1.1881 1.5663 2.3109 2.1562 1.4854 1.0960 2.4949 1.2588 1.2633 1.3209 8.5542 1.2067 1.2315 2.4941 1.1713 1.9673 1.0423 1.0549 1.1513 1.0480 5.8499 6.3623 1.0383 1.0353 1.0574 1.0954 1.1025 1.0987 1.0998 1.1069 1.0871 1.0918 1.0926 1.0982
irintensity: 1.1618 0.9341 0.1214 0.7099 2.8586 0.6087 0.0476 0.0887 1.5808 0.9751 0.3838 8.0006 0.5987 0.6971 4.1804 1.8798 25.2689 11.4841 43.5803 11.8973 2.6362 2.2252 1.9189 5.4416 1.1322 17.2333 0.5311 16.1963 3.0472 12.4955 3.2088 0.2951 2.8138 0.1250 23.7502 0.4199 0.8063 18.4834 12.0744 2.8580 2.6639 20.9253 12.8174 12.9740 27.6263 8.1272 13.0399 24.0824 33.3442 36.2298 18.1755 21.6620 4.0892 27.7870 17.9964 42.8050 7.6904 10.1590 20.5452 14.6836
temp: 298.150 k
press: 1.00000 atm
elementType: 16 6 6 6 6 6 6 6 6 6 1 1 1 1 1 1 1 1 1 1 1 1
symmnumber: 1
zpe: 477029.6 jmol-1
zpe.correction: 0.181691 hartree
zpe.thermalcorrener: 0.193023 hartree
zpe.thermalcorrenthalpy: 0.193967 hartree
zpe.thermalcorrgfe: 0.141480 hartree
zpe.sumelectzpe: -747.465549 hartree
zpe.sumelectthermal: -747.454218 hartree
zpe.sumelectthermalent: -747.453274 hartree
zpe.sumelectthermalfe: -747.505760 hartree
dipole: 0.8411 -1.0372 1.6307
dipole: 2.1077
quadrupole: -59.9217 -63.0382 -71.7093
quadrupole: 1.1531 -2.4181 1.5176
quadrupole: 4.9681 1.8515 -6.8196 1.1531 -2.4181 1.5176
hfenergy: -747.6472404 hartree
pointgroup: C01 [X(C9H12S1)]
dipole: -0.2937612 -0.4469538 -0.6336766 debye
dipolederiv: -0.2929967 0.0458975 0.0801595 0.1504313 -0.1735061 0.0569912 0.1321599 0.0403869 -0.0533919 0.1288168 0.2268997 -0.0243181 0.1761388 0.2672575 -0.0381734 -0.0472963 -0.062199 -0.0131844 0.6031327 -0.0069564 0.0871817 -0.0358951 0.0452591 -0.0828824 0.1119691 -0.0628462 -0.1219859 -0.3158828 -0.175217 0.0403722 -0.0349125 -0.0765349 -0.0415119 -0.0660882 -0.0625927 -0.1192834 0.0290796 0.0038987 0.0721872 -0.0941449 -0.1692083 -0.0169657 0.0750524 0.0102149 -0.1613247 -0.2949896 0.10505 -0.0110972 0.0038542 -0.0299411 -0.0044273 -0.0056525 0.0039649 -0.1400703 0.1669676 -0.0943466 -0.2031402 -0.2008834 0.1710358 0.0484969 -0.327956 0.0493796 0.2146565 0.0216115 -0.0750872 0.0641325 0.0076027 0.0845909 -0.0469474 0.0633408 -0.0612783 -0.1001567 -0.0290602 -0.1227198 0.0168735 -0.0794468 -0.0648985 0.014815 0.0648929 0.0837536 0.0627535 -0.1156636 0.0238496 -0.0172584 0.1146328 0.0534426 -0.020845 0.1991431 -0.0418884 0.0219645 0.0789597 0.0697641 -0.0435301 0.0616824 -0.032227 0.0493643 -0.0384916 0.0430449 0.115315 -0.1197068 -0.0073526 -0.0700624 -0.0285766 0.0894395 0.001948 -0.0791644 0.0057465 0.1309579 0.0645879 -0.0942295 -0.0127824 -0.076549 -0.0151373 0.0204106 -0.0131821 0.0133208 0.1415141 -0.0172251 -0.0769358 0.0163653 -0.058726 -0.0939675 -0.0780372 0.0311913 -0.0553692 0.0057129 0.0120702 0.056182 -0.0109561 0.0589473 0.0061656 0.0630211 0.0392162 0.0417096 -0.1327995 0.0186417 0.0791194 -0.0469927 0.0826139 -0.0710722 0.0646739 -0.0596139 0.0670536 0.128298 0.0033942 0.1418007 0.0227413 0.0435288 -0.0771826 -0.0231138 -0.0029477 -0.0317868 0.1035255 0.0276609 -0.0654431 0.0869545 -0.0594779 0.0353684 0.0077936 0.1176766 0.0481018 -0.0779798 -0.0436316 -0.0468862 -0.1165326 0.0011913 0.0567341 0.0317474 -0.14442 -0.0397346 -0.0083365 0.0507063 -0.0588086 -0.0097989 -0.1390561 -0.0935371 -0.0225045 -0.0595009 -0.0245745 0.1022823 0.0894331 0.0070314 -0.0118015 0.0243105 0.0222528 0.1070343 -0.0980162 0.1271208 -0.0520614 -0.0659058 0.06449 0.0913029 0.0827344 0.0656666 -0.0908879 0.1076874 -0.091528 -0.0464058 unknown
polarizability: 156.4709965|0.8020053|111.2028561|6.1373411|-4.0582317|72.6694678 unknown
InChI: InChI=1S/C9H12S/c1-3-10-9-6-4-5-8(2)7-9/h4-7H,3H2,1-2H3
charge 0 multiplicity 1
22 atoms
S  2.029221 0.452332 0.912968
C  -1.832899 -0.8494 0.044629
C  0.259075 0.410099 0.378298
C  -0.467592 -0.802481 0.426626
C  -2.455955 0.353187 -0.381019
C  -0.372463 1.60307 -0.042827
C  2.84134 -0.383355 -0.602241
C  -1.735659 1.567887 -0.418375
C  -2.617749 -2.147978 0.127313
C  4.348228 -0.521289 -0.347158
H  0.031407 -1.713604 0.778177
H  -3.511187 0.336394 -0.680393
H  0.197058 2.537223 -0.076634
H  2.358196 -1.365525 -0.73757
H  2.628072 0.247905 -1.480792
H  -2.231578 2.48828 -0.746911
H  -1.964386 -3.027357 -0.009758
H  -3.107356 -2.252843 1.115061
H  -3.412682 -2.189369 -0.6382
H  4.819827 0.465141 -0.1895
H  4.547299 -1.144369 0.542948
H  4.837685 -0.99825 -1.216541
