program: Gaussian 09
title: 000002746
version: EM64L-G09RevD.01
frameworkgroup: C1[X(C15H15N3O2)]
method: RPBEPBE
basis: SDD
operation: Freq
keyword: #p
keyword: freq=noraman
keyword: PBEPBE/SDD
title: #p freq=noraman PBEPBE/SDD
converged: YES YES NO NO
title: Mulliken charges:
elementType: O O N N N C C C C C C C C C C C C C C C H H H H H H H H H H H H H H H
charge: -0.276076 -0.252391 -0.485017 -0.448140 -0.710597 0.278035 0.348606 0.486980 0.118856 -0.342764 -0.343436 0.167016 -0.453662 -0.369284 -0.330272 -0.342069 -0.239484 -0.234251 0.222640 -0.780040 0.277433 0.216542 0.338108 0.222320 0.310436 0.302712 0.219263 0.305226 0.226037 0.224236 0.303941 0.303897 0.260352 0.260772 0.214075
chargesum: 0.00000
title: Mulliken charges with hydrogens summed into heavy atoms:
elementType: O O N N N C C C C C C C C C C C C C C C
charge: -0.276076 -0.252391 -0.146910 -0.142914 -0.102759 0.278035 0.348606 0.486980 0.118856 -0.065331 -0.126895 0.167016 -0.231342 -0.058848 -0.027560 -0.122806 -0.013447 -0.010015 0.222640 -0.044841
polarizability: 3.70130717e+02 1.77177700e+00 1.96948354e+02 1.09861671e+01 -1.53715900e+00 9.02684189e+01
1716.lowfreq: -6.0132 -2.9895 -0.0009 -0.0007 0.0008 4.2608 21.6262 29.1517 46.8701
frequency: 21.5842 29.1416 46.8689 49.3681 66.2467 74.4907 89.4144 132.0877 152.2027 179.7707 197.7620 220.5515 259.6595 285.3203 307.9578 323.3791 348.0836 373.6515 408.3997 432.2482 452.0602 461.3411 508.9504 542.2682 548.2980 552.6091 593.8580 596.0592 630.3619 632.3580 651.3052 679.0736 686.1976 723.9509 753.9985 756.5889 772.5688 779.9377 832.2838 841.2303 846.3122 859.5472 862.3561 878.0607 931.5574 939.6094 980.7261 981.4003 989.4469 992.8394 1006.4233 1032.0817 1039.8898 1057.8998 1094.1064 1124.1347 1130.2723 1169.9251 1191.1174 1212.3013 1219.2243 1251.7457 1265.7240 1293.1163 1303.0326 1319.5818 1364.4513 1389.7049 1391.0609 1417.2981 1448.0878 1448.5621 1469.0077 1469.7611 1489.2341 1503.2101 1517.6385 1571.4031 1597.6178 1602.5865 1612.6000 1621.4040 1629.0122 1646.3058 2996.4352 3097.8588 3099.9084 3114.5047 3120.0866 3122.5825 3139.3234 3161.2034 3163.9258 3194.2031 3194.5480 3464.4567 3474.9573 3531.9270 3608.0073
redmass: 4.4204 4.3328 2.6726 1.5836 5.6626 3.0296 4.7626 5.3915 4.3564 3.7337 5.3529 3.0113 2.4192 4.7435 2.3832 4.6922 4.8499 5.5221 2.9165 3.2207 3.7120 4.0967 3.0106 5.9436 4.5592 3.4046 5.9159 3.2151 2.1614 2.3165 1.1856 4.9628 4.8288 2.8925 2.1881 1.3993 2.5693 2.4434 4.5684 1.7592 2.2082 1.5541 1.8320 4.7462 6.3179 1.3649 1.3162 1.3461 1.3676 1.6482 2.8011 2.1538 1.6356 1.9025 2.6526 1.3520 1.3900 1.0672 1.1738 2.0262 3.0037 2.8440 1.9933 2.0693 1.6572 1.6046 4.6058 1.3243 4.5046 4.3927 2.7383 1.0451 2.3559 1.0996 2.1488 2.9103 2.7211 5.4448 6.2162 4.8377 5.5313 4.9903 5.5436 1.2054 1.0363 1.0997 1.0989 1.0900 1.0875 1.0900 1.0899 1.0979 1.0943 1.0952 1.0945 1.0746 1.0476 1.0765 1.0973
irintensity: 5.1057 2.6996 0.7018 0.5848 10.0776 1.2417 3.0598 8.5141 4.4414 3.5323 0.5930 19.6941 21.9766 5.8285 24.5523 1.9738 0.8657 17.1385 0.1655 4.2650 12.0298 10.3252 16.4189 13.7228 5.2568 4.9282 8.6760 0.3386 120.2107 96.3723 58.0463 10.0725 12.1714 7.1603 15.6318 89.7695 54.0914 62.3538 2.1170 0.8766 6.8985 25.1356 45.1955 17.7538 2.2519 7.6408 3.1130 0.8934 3.3355 18.8346 9.0956 7.9409 15.2248 18.4400 4.6125 55.2871 2.0734 2.0072 49.6816 1.7181 114.6730 102.2025 69.8408 45.6470 105.2391 6.5186 211.5139 95.9977 28.6731 15.7370 177.5492 15.9311 119.5062 34.2389 372.4169 517.9858 101.4082 46.9253 62.2744 145.8854 11.1416 61.1025 92.3704 60.0763 13.5969 14.4209 10.9798 29.0601 11.1462 12.8127 16.6609 34.4295 3.5076 5.9362 5.5625 42.7530 7.7305 14.3344 17.6612
temp: 298.150 k
press: 1.00000 atm
elementType: 8 8 7 7 7 6 6 6 6 6 6 6 6 6 6 6 6 6 6 6 1 1 1 1 1 1 1 1 1 1 1 1 1 1 1
symmnumber: 1
zpe: 721580.2 jmol-1
zpe.correction: 0.274835 hartree
zpe.thermalcorrener: 0.293263 hartree
zpe.thermalcorrenthalpy: 0.294207 hartree
zpe.thermalcorrgfe: 0.225973 hartree
zpe.sumelectzpe: -893.922933 hartree
zpe.sumelectthermal: -893.904505 hartree
zpe.sumelectthermalent: -893.903561 hartree
zpe.sumelectthermalfe: -893.971795 hartree
dipole: 2.7829 1.4185 1.9719
dipole: 3.6939
quadrupole: -84.4765 -115.2647 -119.8813
quadrupole: -28.9883 3.6588 4.8043
quadrupole: 22.0643 -8.7239 -13.3405 -28.9883 3.6588 4.8043
hfenergy: -894.1977681 hartree
pointgroup: C01 [X(C15H15N3O2)]
dipole: 1.1050157 -0.5511706 -0.7662845 debye
polarizability: 370.4039685|-2.6711744|196.9960052|-6.105845|0.3675928|89.9475157 unknown
InChI: InChI=1S/C15H15N3O2/c1-10(19)17-12-8-6-11(7-9-12)15(20)18-14-5-3-2-4-13(14)16/h2-9,17-18H,16H2,1H3
charge 0 multiplicity 1
35 atoms
O  -1.345013 2.289541 -0.011431
O  5.097743 -2.000095 0.611401
N  -1.758857 -0.01768 -0.057778
N  4.797906 0.267425 0.074796
N  -2.93059 -2.390224 -0.706802
C  0.557257 0.784956 0.031966
C  -3.176353 -0.053829 0.009929
C  3.381291 0.389311 0.075125
C  -0.917226 1.090356 -0.005048
C  1.443464 1.856883 -0.251263
C  1.114922 -0.480585 0.354333
C  -3.779355 -1.319141 -0.28684
C  2.832603 1.665344 -0.234828
C  2.507932 -0.690134 0.377852
C  -3.986029 1.043026 0.395383
C  -5.1723 -1.482134 -0.107816
C  -5.378503 0.864628 0.549068
C  -5.971195 -0.39863 0.322028
C  5.580443 -0.86451 0.330491
C  7.086755 -0.627418 0.246191
H  1.007443 2.835552 -0.47498
H  0.475107 -1.327663 0.631599
H  -1.337377 -0.953004 -0.086218
H  3.500199 2.506921 -0.461424
H  2.930783 -1.663179 0.632207
H  -3.512589 2.009792 0.575874
H  -5.631167 -2.453981 -0.328203
H  5.307848 1.126645 -0.14246
H  -5.997383 1.715082 0.854216
H  -7.049755 -0.536484 0.454289
H  -3.329496 -3.328157 -0.642636
H  -2.383661 -2.238466 -1.559436
H  7.515907 -1.317857 -0.500056
H  7.542977 -0.876743 1.219759
H  7.366664 0.405951 -0.022788
