program: Gaussian 09
title: 000141877
version: EM64L-G09RevD.01
frameworkgroup: C1[X(C15H13N)]
method: RPBEPBE
basis: SDD
operation: Freq
keyword: #pfreq=noraman
keyword: PBEPBE/SDD
title: #p freq=noraman PBEPBE/SDD
converged: NO YES NO NO
title: Mulliken charges:
elementType: N C C C C C C C C C C C C C C C H H H H H H H H H H H H H
charge: -0.022386 -0.585970 -0.583164 0.532812 0.514281 -0.540046 -0.398996 -0.404741 -0.405500 0.392967 -0.206809 -0.226908 -0.227206 -0.379387 -0.241271 -0.265712 0.228059 0.230929 0.223761 0.226640 0.261650 0.241177 0.231694 0.229566 0.235159 0.225694 0.224873 0.259652 0.229182
chargesum: 0.00000
title: Mulliken charges with hydrogens summed into heavy atoms:
elementType: N C C C C C C C C C C C C C C C
charge: -0.022386 -0.126982 -0.132763 0.532812 0.514281 -0.278396 -0.157818 -0.173047 -0.175935 0.392967 0.028350 -0.001215 -0.002333 -0.119735 -0.012089 -0.265712
polarizability: 2.35415105e+02 -1.45705658e+01 1.78155896e+02 1.77630464e+01 4.03257264e+00 7.79707418e+01
1716.lowfreq: -13.4534 -0.0005 -0.0004 0.0001 4.4650 8.4228 10.8495 28.7381 35.9791
frequency: 8.6571 28.6428 35.8678 56.8919 107.9010 143.1530 149.4334 229.1502 284.4383 308.7404 362.1415 383.1634 402.8730 453.1113 460.0397 506.6740 520.2553 557.8780 590.8489 617.7940 641.1717 700.1363 704.8491 717.9448 759.6571 787.2783 806.3200 827.6475 854.0646 899.9242 919.8790 928.6345 933.9882 976.4601 987.4761 990.0027 992.4749 992.9571 994.8395 1005.8899 1027.1111 1075.2715 1097.4157 1142.1356 1159.8663 1172.7292 1185.6135 1187.1740 1216.3834 1247.8624 1268.7898 1272.3251 1312.1154 1322.0675 1327.8275 1376.2277 1382.4290 1426.7508 1440.6860 1471.2943 1475.8080 1484.3379 1489.0032 1586.1431 1593.1118 1609.7049 1614.4523 2174.2539 2986.6532 2997.1959 3036.1224 3063.7209 3111.4778 3112.8330 3124.2512 3130.8545 3139.7168 3143.2498 3148.2242 3162.1508 3169.8627
redmass: 4.2430 4.6958 3.2120 4.4130 5.2685 5.9482 5.8596 4.7871 3.6885 2.2262 2.7997 4.4493 2.8182 8.2807 3.7226 3.4229 5.7937 6.9478 4.5494 6.3641 5.9587 2.2940 1.8432 3.4915 2.0275 1.1953 1.9702 2.3673 1.2471 2.0695 1.4405 2.2268 1.4184 1.3900 5.8730 6.2485 1.7056 1.4737 1.3555 3.5080 2.1883 1.5950 1.6013 1.1974 1.6477 1.0517 1.0882 1.1135 2.4894 2.5606 1.2373 1.5983 1.2646 1.3944 1.2545 7.7235 7.9509 2.9155 2.1813 1.7067 1.4347 2.1899 1.1046 5.8023 6.0427 6.1621 6.1786 12.6324 1.0590 1.0596 1.1014 1.1050 1.0881 1.0870 1.0887 1.0900 1.0926 1.0955 1.0914 1.1014 1.0990
irintensity: 0.7625 1.1811 0.0756 0.0446 0.1890 2.0926 1.9082 0.2210 2.0579 0.0184 0.4757 0.1478 0.0004 0.0501 0.6542 25.9933 3.0223 0.2004 3.9328 0.0447 0.3286 12.4726 69.2977 1.5582 30.8655 0.9163 51.7843 8.2547 0.0018 2.7359 9.0713 3.0793 7.7137 0.0028 0.1578 0.2442 0.4460 0.7527 0.5060 1.6674 6.8834 11.2659 1.4890 7.3736 4.8319 0.1592 0.2842 0.1105 0.0514 1.5571 0.1003 11.6177 0.4776 0.5264 0.0916 1.3834 0.0456 8.1411 6.3524 6.3422 12.2872 18.2781 13.8069 13.3411 1.8175 13.1243 10.4006 34.9236 5.4096 50.6468 0.5889 22.4455 8.4455 13.1225 8.0260 7.5147 5.8003 41.3480 10.1973 26.2378 11.0178
temp: 298.150 k
press: 1.00000 atm
elementType: 7 6 6 6 6 6 6 6 6 6 6 6 6 6 6 6 1 1 1 1 1 1 1 1 1 1 1 1 1
symmnumber: 1
zpe: 610660.4 jmol-1
zpe.correction: 0.232588 hartree
zpe.thermalcorrener: 0.246371 hartree
zpe.thermalcorrenthalpy: 0.247316 hartree
zpe.thermalcorrgfe: 0.188199 hartree
zpe.sumelectzpe: -633.033303 hartree
zpe.sumelectthermal: -633.019520 hartree
zpe.sumelectthermalent: -633.018576 hartree
zpe.sumelectthermalfe: -633.077692 hartree
dipole: 3.3417 -3.5886 0.2851
dipole: 4.9119
quadrupole: -108.0102 -90.6376 -99.1086
quadrupole: 19.0595 2.3135 2.0214
quadrupole: -8.7581 8.6145 0.1436 19.0595 2.3135 2.0214
hfenergy: -633.2658915 hartree
pointgroup: C01 [X(C15H13N1)]
dipole: 1.3278981 1.3988633 -0.1197022 debye
polarizability: 235.4474552|14.0489827|177.8621053|-18.7908603|4.2285732|78.2321828 unknown
InChI: InChI=1S/C15H13N/c16-12-15-8-4-7-14(11-15)10-9-13-5-2-1-3-6-13/h1-8,11H,9-10H2
charge 0 multiplicity 1
29 atoms
N  -5.12529 -2.343338 0.183221
C  0.257321 0.371175 -0.669911
C  1.076704 0.175956 0.648457
C  -1.219902 0.600595 -0.395147
C  2.555036 -0.049416 0.369121
C  -2.113952 -0.491541 -0.297707
C  -1.727231 1.909863 -0.183291
C  3.062638 -1.357105 0.154115
C  3.451034 1.046649 0.271776
C  -3.486005 -0.284309 0.010326
C  -3.090268 2.12388 0.121247
C  4.426137 -1.565319 -0.152706
C  4.815438 0.844481 -0.035003
C  -3.977527 1.033412 0.222009
C  5.30776 -0.463764 -0.250217
C  -4.381103 -1.409231 0.104918
H  0.683732 1.229269 -1.222916
H  0.398925 -0.523815 -1.304558
H  0.93463 1.06995 1.285369
H  0.651733 -0.684009 1.200402
H  -1.751962 -1.512521 -0.464906
H  -1.047584 2.767097 -0.2649
H  2.385771 -2.217458 0.236221
H  3.077749 2.064223 0.446315
H  -3.462927 3.141813 0.277104
H  4.801314 -2.582933 -0.310834
H  5.493754 1.702875 -0.101347
H  -5.035527 1.187638 0.455548
H  6.366104 -0.623415 -0.485206
