program: Gaussian 09
title: 000141872
version: EM64L-G09RevD.01
frameworkgroup: C1[X(C7H5ClO3)]
method: RPBEPBE
basis: SDD
operation: Freq
keyword: #p
keyword: freq=noraman
keyword: PBEPBE/SDD
title: #p freq=noraman PBEPBE/SDD
converged: NO NO NO NO
title: Mulliken charges:
elementType: Cl O O O C C C C C C C H H H H H
charge: -0.042353 -0.408940 -0.439102 -0.244264 0.296796 -0.455780 -0.342718 0.426731 -0.307516 -0.195543 0.122884 0.299337 0.281263 0.259027 0.362144 0.388035
chargesum: 0.00000
title: Mulliken charges with hydrogens summed into heavy atoms:
elementType: Cl O O O C C C C C C C
charge: -0.042353 -0.046795 -0.051067 -0.244264 0.296796 -0.156444 -0.061455 0.426731 -0.307516 0.063484 0.122884
polarizability: 1.51983232e+02 -6.21220567e-01 9.98864763e+01 -4.00915427e-03 -2.56522660e-04 3.64656641e+01
1716.lowfreq: -0.0013 0.0012 0.0014 3.6543 9.3203 15.3491 65.6550 86.2206 161.5213
frequency: 65.6415 86.2133 161.5211 199.4501 242.9915 284.4991 292.9967 367.4962 439.1608 453.0725 488.2726 530.0594 530.2199 548.7061 618.6364 622.2336 695.2332 706.7345 738.8432 826.9140 895.4043 921.7170 963.2725 1011.5344 1039.0477 1125.4739 1140.4235 1179.0035 1235.2849 1273.6752 1323.1293 1394.9914 1442.4506 1465.7516 1580.2454 1612.6557 1641.3129 3164.7461 3177.0684 3193.1140 3500.9873 3525.4213
redmass: 10.4474 9.0285 9.1898 5.0604 8.0962 6.4322 15.4519 7.3508 2.8731 1.1388 8.4697 4.4554 2.8498 7.6471 1.4604 5.0111 4.7194 6.6047 3.3546 1.4243 6.0316 1.5286 1.3463 6.7520 2.7526 1.4947 1.4300 1.3892 2.4769 1.4496 2.5048 8.8725 3.8254 2.9298 7.9189 6.8405 8.8046 1.0902 1.0926 1.0961 1.0649 1.0642
irintensity: 0.7317 0.0001 0.7188 2.1820 4.8171 0.0008 1.2456 0.6133 42.9416 118.0594 35.4958 36.5326 26.8505 22.1659 106.4594 4.6468 20.6501 35.9482 51.7028 22.4641 94.7906 27.0756 0.6345 44.4501 194.4654 54.2431 1.0464 242.0653 38.6566 51.9022 112.0382 38.8295 78.9892 27.6469 56.9129 33.0575 261.7813 0.8573 3.8660 1.0184 60.2803 50.9150
temp: 298.150 k
press: 1.00000 atm
elementType: 17 8 8 8 6 6 6 6 6 6 6 1 1 1 1 1
symmnumber: 1
zpe: 279361.6 jmol-1
zpe.correction: 0.106403 hartree
zpe.thermalcorrener: 0.116089 hartree
zpe.thermalcorrenthalpy: 0.117034 hartree
zpe.thermalcorrgfe: 0.070700 hartree
zpe.sumelectzpe: -954.695680 hartree
zpe.sumelectthermal: -954.685993 hartree
zpe.sumelectthermalent: -954.685049 hartree
zpe.sumelectthermalfe: -954.731383 hartree
dipole: 0.7721 -2.4236 0.0000
dipole: 2.5436
quadrupole: -61.8788 -71.4268 -71.7926
quadrupole: 8.1606 0.0017 0.0010
quadrupole: 6.4873 -3.0608 -3.4265 8.1606 0.0017 0.0010
hfenergy: -954.8020828 hartree
pointgroup: C01 [X(C7H5Cl1O3)]
dipole: 0.2705317 -0.9634681 -0.0000023 debye
dipolederiv: -0.8354098 0.0916008 0.000092 0.0707465 -0.1632767 -0.0000084 0.0001139 -0.0000134 -0.0431825 -0.6535628 -0.5875796 0.0000252 -0.6506302 -0.819946 0.0000786 0.0000349 0.0000985 -0.4019175 -0.8836264 -0.4760628 -0.0000353 -0.6150397 -0.8227936 -0.0000788 -0.0004611 -0.0005395 -0.4268638 -0.9269279 0.2878503 0.0001048 0.2396049 -0.8731913 -0.0003732 -0.000353 0.0004068 -0.3295162 -0.6709948 0.1302911 -0.0000665 0.0356551 0.1128514 0.0000132 0.0001075 -0.0000467 0.0122729 0.0116754 -0.3754687 -0.0000279 0.2140068 -0.0797398 -0.0000062 0.0001327 0.000035 -0.1267778 0.0217292 0.1130033 -0.0000276 -0.1504648 -0.1015348 0.0000201 0.0001571 -0.0000364 -0.1531957 0.2561435 0.783772 -0.0000201 0.7509416 0.6616289 -0.0000999 -0.0000397 -0.0001526 0.1075141 1.1285878 -0.0987645 -0.0001545 -0.3560573 -0.021674 0.0000421 -0.0001432 0.000011 -0.1050704 -0.24361 -0.1174632 0.0000164 0.0153258 0.029487 0.0000065 0.0000054 0.0000613 -0.0683373 2.0541919 0.0153838 0.000132 0.108906 1.3686923 0.0004237 0.000527 0.000197 0.236533 0.1131433 0.0369979 0.0000127 0.0009177 0.0577644 -0.0000071 0.0000208 0.0000032 0.1761608 0.0739107 -0.0542296 0.0000246 -0.0468283 0.0433982 0.0000061 0.0000385 -0.0000035 0.1733332 0.0669017 0.0576616 0.0000053 0.0536193 -0.0046609 -0.0000094 -0.0000183 -0.0000251 0.1644671 0.2579694 0.0989881 0.0000177 0.1547127 0.350106 -0.0000168 0.000002 -0.0000042 0.3798166 0.2298787 0.0940193 -0.0000988 0.1745838 0.262889 0.0000094 -0.0001245 0.0000086 0.4047635 unknown
polarizability: 151.8775452|-2.4250095|99.9921628|-0.0040156|-0.0001174|36.4656641 unknown
InChI: InChI=1S/C7H5ClO3/c8-5-2-1-4(7(10)11)3-6(5)9/h1-3,9-10H
charge 0 multiplicity 1
16 atoms
Cl 3.649529 -0.703234 -0.000318
O  2.13991 1.968587 -0.00013
O  -3.155473 -1.01851 -0.000374
O  -2.944625 1.294619 -0.000207
C  -0.933379 -0.098044 0.000358
C  -0.070396 1.022883 0.000199
C  -0.40903 -1.417929 0.000254
C  1.327327 0.837113 -0.000001
C  1.833751 -0.489244 -0.000067
C  0.986647 -1.611169 0.000059
C  -2.399788 0.164006 0.000666
H  -0.47902 2.037303 0.000274
H  -1.091679 -2.270439 0.000361
H  1.415087 -2.617551 -0.000015
H  3.099394 1.706623 -0.000255
H  -4.121955 -0.781116 -0.001006
