program: Gaussian 09
title: 000141867
version: EM64L-G09RevD.01
frameworkgroup: C1[X(C12H23Cl)]
method: RPBEPBE
basis: SDD
operation: Freq
keyword: #p
keyword: freq=noraman
keyword: PBEPBE/SDD
title: #p freq=noraman PBEPBE/SDD
converged: NO YES NO NO
title: Mulliken charges:
elementType: Cl C C C C C C C C C C C C H H H H H H H H H H H H H H H H H H H H H H H
charge: -0.104841 -0.383949 -0.376061 -0.339389 -0.392308 -0.394393 -0.403434 -0.381878 -0.382110 -0.392905 -0.385586 -0.402319 -0.377948 0.262408 0.207417 0.232090 0.211208 0.221815 0.225539 0.202801 0.199056 0.220447 0.198552 0.197545 0.188463 0.195010 0.170704 0.203721 0.199416 0.194364 0.210236 0.205604 0.192591 0.197801 0.198152 0.182182
chargesum: 0.00000
title: Mulliken charges with hydrogens summed into heavy atoms:
elementType: Cl C C C C C C C C C C C C
charge: -0.104841 -0.121541 0.063446 0.093633 0.036032 0.025110 -0.007336 0.001594 -0.007684 0.000874 0.030254 -0.011927 0.002385
polarizability: 1.55135236e+02 -7.04649994e-01 1.37109291e+02 4.55793787e+00 1.19457377e-01 1.13621215e+02
1716.lowfreq: -19.4039 -14.3891 -2.5325 -0.0020 -0.0017 -0.0011 49.3405 67.2099 109.1449
frequency: 48.8033 66.7603 109.0567 133.8550 147.5580 164.1971 182.9285 207.4580 219.1095 249.7339 269.4966 274.4496 315.8784 331.5278 349.8099 377.4732 420.6161 465.3651 491.4249 546.4113 619.3779 695.7905 720.1013 737.0714 773.7825 777.7894 802.3309 824.1668 849.5914 887.9176 907.2592 923.9334 935.1153 976.9809 981.7932 1016.9349 1029.1234 1036.5527 1067.4463 1088.4260 1093.8581 1109.6572 1118.2085 1124.7549 1138.9081 1153.5000 1169.4687 1178.7466 1202.7605 1231.0689 1243.6226 1246.6879 1263.3419 1276.6604 1284.7649 1288.8195 1298.2080 1306.2105 1311.1814 1328.5807 1340.1411 1343.1140 1343.6473 1346.3453 1350.0816 1356.0664 1358.0869 1365.8991 1454.5834 1457.1961 1461.5474 1465.4913 1466.1463 1471.6861 1475.9412 1477.1508 1478.8776 1486.9644 1493.3932 2954.2489 2957.1907 2958.2827 2965.2421 2968.0458 2972.9598 2979.3057 2980.7244 2984.1899 3002.0036 3003.0516 3004.1925 3009.0964 3012.6199 3017.4987 3023.4877 3029.2349 3033.4234 3041.7255 3052.8691 3058.2013 3063.6773 3073.1851
redmass: 3.3274 3.0097 3.7716 4.3641 2.2324 2.6791 2.6961 2.3388 2.2968 2.4862 2.0721 2.0584 3.5989 2.4610 2.2820 2.1492 2.4763 2.4496 2.0049 2.8121 3.3217 1.2107 1.3838 1.5018 1.7310 1.5062 2.0479 1.6905 2.1041 2.2173 1.9745 2.0398 1.8125 1.8548 1.9400 1.8468 2.0143 2.0172 2.2278 2.0175 1.5320 2.3521 1.6770 2.1361 1.3138 1.7204 1.3193 1.3300 1.4383 1.2985 1.2746 1.2985 1.1905 1.2881 1.1846 1.1754 1.1642 1.1814 1.2569 1.4107 1.3164 1.3674 1.4222 1.3860 1.3695 1.4542 1.4125 1.4088 1.0764 1.0830 1.0755 1.0833 1.0836 1.0823 1.0806 1.0884 1.0869 1.0837 1.0886 1.0600 1.0610 1.0608 1.0626 1.0631 1.0650 1.0686 1.0654 1.0621 1.0623 1.0966 1.0693 1.0922 1.0989 1.0971 1.0949 1.0996 1.0964 1.0907 1.0909 1.0999 1.0972 1.0994
irintensity: 0.4900 0.4904 0.8054 0.8471 0.2209 0.3362 0.3667 0.3238 0.1697 0.6296 0.1748 0.4600 3.9399 4.1932 1.1081 0.5063 3.6676 1.3602 3.9222 6.7660 24.2800 17.6125 14.2670 11.6784 1.4914 4.4236 0.7003 8.8223 3.7704 8.8382 0.1446 1.4977 5.3435 2.4208 0.2630 0.8616 1.4822 3.3378 5.8692 2.2596 1.3310 0.9658 2.0764 2.2930 0.4427 4.1063 4.8089 7.3152 1.1379 9.1679 1.3644 11.3536 0.4020 7.9830 3.6822 2.2675 5.0471 6.3530 2.0692 2.2317 0.2941 0.1289 3.2252 1.3488 0.0554 1.4521 3.0696 1.4194 6.5739 6.2846 4.5745 3.0167 11.5017 1.4362 12.7764 3.2528 2.8405 0.4212 54.6091 37.5088 11.9139 22.7129 28.3145 46.6030 45.2223 35.5223 17.9091 27.6917 11.8370 12.6097 3.5573 36.0888 38.4187 64.4603 52.9438 120.8480 12.3531 4.4423 33.1043 92.5069 119.1319 42.8368
temp: 298.150 k
press: 1.00000 atm
elementType: 17 6 6 6 6 6 6 6 6 6 6 6 6 1 1 1 1 1 1 1 1 1 1 1 1 1 1 1 1 1 1 1 1 1 1 1
symmnumber: 1
zpe: 858495.4 jmol-1
zpe.correction: 0.326984 hartree
zpe.thermalcorrener: 0.341369 hartree
zpe.thermalcorrenthalpy: 0.342313 hartree
zpe.thermalcorrgfe: 0.286246 hartree
zpe.sumelectzpe: -930.054984 hartree
zpe.sumelectthermal: -930.040598 hartree
zpe.sumelectthermalent: -930.039654 hartree
zpe.sumelectthermalfe: -930.095721 hartree
dipole: 2.5365 0.4325 1.3553
dipole: 2.9083
quadrupole: -100.1098 -88.3721 -89.3182
quadrupole: -3.0484 -4.1871 -1.5943
quadrupole: -7.5098 4.2279 3.2818 -3.0484 -4.1871 -1.5943
hfenergy: -930.3819673 hartree
pointgroup: C01 [X(C12H23Cl1)]
dipole: 0.9336994 -0.2964519 -0.5911868 debye
polarizability: 154.4015526|-1.7305514|137.2055437|-6.5375417|1.8088078|114.2586468 unknown
InChI: InChI=1S/C12H23Cl/c13-12-10-8-6-4-2-1-3-5-7-9-11-12/h12H,1-11H2
charge 0 multiplicity 1
36 atoms
Cl -3.53883 1.432196 0.889394
C  -2.157412 1.073559 -0.412358
C  -2.160812 -0.435736 -0.713909
C  -0.846649 1.678323 0.122397
C  -1.868413 -1.372793 0.490089
C  0.312695 1.590576 -0.905365
C  -1.081709 -2.662089 0.123139
C  1.663238 2.155689 -0.380851
C  0.330971 -2.424434 -0.479972
C  2.34131 1.390003 0.79217
C  1.278179 -1.589769 0.416464
C  3.209648 0.155483 0.411493
C  2.497963 -1.004184 -0.336414
H  -2.515928 1.639681 -1.2899
H  -1.403462 -0.592691 -1.508626
H  -3.134053 -0.700169 -1.167789
H  -0.568628 1.172706 1.06482
H  -1.027786 2.739294 0.379987
H  -2.826867 -1.657701 0.961983
H  -1.315206 -0.81975 1.270732
H  0.025911 2.16114 -1.813249
H  0.449207 0.543696 -1.226146
H  -1.676667 -3.262515 -0.595604
H  -0.985485 -3.280335 1.039066
H  1.490684 3.204725 -0.063198
H  2.376887 2.205703 -1.229243
H  0.228544 -1.910275 -1.458482
H  0.794217 -3.405293 -0.709228
H  1.579278 1.101626 1.542437
H  3.011324 2.099898 1.318106
H  1.621804 -2.199024 1.277015
H  0.703623 -0.752398 0.848297
H  3.658438 -0.243008 1.345507
H  4.058008 0.504545 -0.213029
H  3.237394 -1.806413 -0.536085
H  2.171685 -0.644469 -1.333149
