program: Gaussian 09
title: 000141858
version: EM64L-G09RevD.01
frameworkgroup: C1[X(C12H16)]
method: RPBEPBE
basis: SDD
operation: Freq
keyword: #p
keyword: freq=noraman
keyword: PBEPBE/SDD
title: #p freq=noraman PBEPBE/SDD
converged: YES YES NO NO
title: Mulliken charges:
elementType: C C C C C C C C C C C C H H H H H H H H H H H H H H H H
charge: 0.278760 0.287937 -0.544537 -0.540027 -0.533435 -0.499208 -0.385490 -0.394209 -0.315797 -0.273297 -0.255255 -0.258164 0.231664 0.240137 0.229701 0.220071 0.210516 0.203238 0.203863 0.215477 0.204460 0.196992 0.187208 0.204644 0.226092 0.228068 0.215500 0.215090
chargesum: 0.00000
title: Mulliken charges with hydrogens summed into heavy atoms:
elementType: C C C C C C C C C C C C
charge: 0.278760 0.287937 -0.072735 -0.090255 -0.119680 -0.079868 0.015962 -0.002357 -0.089705 -0.045229 -0.039755 -0.043074
polarizability: 1.27046886e+02 2.81782270e-01 1.20779310e+02 -9.25029729e+00 -1.17758141e+00 1.02552143e+02
1716.lowfreq: -10.4072 -0.0007 -0.0006 -0.0004 16.7921 18.7743 115.4807 131.2246 185.7380
frequency: 115.4199 131.1574 185.7155 247.5514 252.4824 324.1255 352.9151 396.0559 397.3892 439.2352 459.3929 515.3107 518.8365 581.9909 621.8876 635.9093 701.2564 745.2679 781.9290 796.1453 843.7291 848.9229 880.0699 889.3924 917.3431 937.4988 948.1178 959.1164 960.7310 975.7197 989.0517 1000.6226 1006.1465 1056.7453 1083.9927 1111.9411 1139.9037 1149.9666 1165.3852 1168.0163 1170.8139 1200.6445 1212.7806 1231.9956 1233.1166 1260.5842 1271.0299 1292.0961 1332.7462 1333.6291 1337.5309 1342.8936 1362.7354 1403.7057 1454.9930 1456.8856 1464.4333 1465.3252 1468.0968 1478.2652 1593.4241 1644.2534 2957.8022 2962.7237 2965.7868 2972.4102 2998.5057 3012.0482 3016.0507 3017.1516 3029.5092 3038.9888 3065.4320 3081.9407 3089.5381 3094.2303 3120.6822 3141.2445
redmass: 3.0499 2.5508 2.7643 2.4427 2.1443 2.0707 1.9751 2.7765 2.9088 2.5260 2.9726 2.5178 3.3932 3.0550 3.0860 3.3723 1.5552 1.6909 1.4512 1.5791 2.1702 2.2335 1.8179 1.6374 2.5903 2.5059 2.3121 1.6065 1.5771 1.3030 1.9462 2.9470 1.8828 1.8619 1.5406 1.8925 1.9055 2.3533 1.3650 1.2743 1.6829 1.3944 1.7598 1.3691 1.3557 1.5920 1.4188 1.7096 1.3359 1.3372 1.4225 1.5121 1.5678 1.7773 1.0834 1.0857 1.0888 1.1055 1.0900 1.0920 9.3301 5.9952 1.0586 1.0599 1.0645 1.0629 1.0581 1.0986 1.0647 1.0971 1.0980 1.1036 1.1068 1.0852 1.0864 1.1065 1.0947 1.0995
irintensity: 0.1719 0.0623 0.0702 0.1887 0.1085 0.2017 0.0492 3.8946 0.8663 4.7774 2.1328 0.9842 0.6217 1.7556 4.6229 2.5512 61.3341 29.5788 1.5782 0.1070 1.5127 5.0910 1.5333 3.4773 4.1937 0.5310 3.9956 1.9643 2.6494 0.4935 6.6834 2.0029 5.3751 1.4842 1.0017 1.8274 3.1169 4.1373 1.2984 2.4046 0.7350 3.6313 0.0441 3.8164 4.7684 1.3502 1.8720 0.3835 0.4483 1.0491 0.2643 0.3017 2.7487 1.4136 4.4476 3.5727 8.7554 5.3165 15.8920 13.6046 6.2630 0.4325 36.8834 32.1197 31.2665 28.6702 39.2955 63.5800 44.3882 20.9186 68.5175 80.9519 14.5557 13.7018 3.1640 46.0322 45.4097 43.7797
temp: 298.150 k
press: 1.00000 atm
elementType: 6 6 6 6 6 6 6 6 6 6 6 6 1 1 1 1 1 1 1 1 1 1 1 1 1 1 1 1
symmnumber: 1
zpe: 644837.5 jmol-1
zpe.correction: 0.245606 hartree
zpe.thermalcorrener: 0.255534 hartree
zpe.thermalcorrenthalpy: 0.256478 hartree
zpe.thermalcorrgfe: 0.211315 hartree
zpe.sumelectzpe: -465.918623 hartree
zpe.sumelectthermal: -465.908695 hartree
zpe.sumelectthermalent: -465.907751 hartree
zpe.sumelectthermalfe: -465.952915 hartree
dipole: -0.5673 -0.1505 0.0712
dipole: 0.5912
quadrupole: -71.5159 -70.5098 -74.5103
quadrupole: -0.4735 -1.8785 -0.3689
quadrupole: 0.6628 1.6689 -2.3317 -0.4735 -1.8785 -0.3689
hfenergy: -466.164229 hartree
pointgroup: C01 [X(C12H16)]
dipole: 0.222785 0.0620492 0.024936 debye
polarizability: 127.4392731|0.1436577|120.6908645|8.6785422|1.8894393|102.2482014 unknown
InChI: InChI=1S/C12H16/c1-2-6-12-8-4-3-7-11(12,5-1)9-10-12/h1-2,5-6H,3-4,7-10H2
charge 0 multiplicity 1
28 atoms
C  -0.007174 -0.755769 0.426335
C  -0.016354 0.828795 0.196482
C  -0.368639 -0.464341 1.942026
C  0.165397 0.997662 1.753442
C  1.417739 -1.369141 0.310235
C  1.052553 1.441548 -0.748578
C  2.225752 -0.812452 -0.883677
C  2.416138 0.712372 -0.715617
C  -1.031193 -1.541082 -0.365127
C  -1.38516 1.328263 -0.240248
C  -2.150678 -0.942492 -0.87281
C  -2.361797 0.509847 -0.734391
H  0.1275 -1.102245 2.69344
H  -1.458719 -0.478591 2.110583
H  -0.417276 1.80232 2.234808
H  1.227981 1.102733 2.04048
H  1.330742 -2.472303 0.246397
H  1.992841 -1.153797 1.234145
H  1.178337 2.516433 -0.503155
H  0.662027 1.397905 -1.786029
H  1.697825 -1.021134 -1.836617
H  3.209018 -1.318694 -0.93874
H  2.935784 0.904486 0.246216
H  3.066043 1.118628 -1.514836
H  -0.86853 -2.621145 -0.491887
H  -1.538412 2.417332 -0.201021
H  -2.906608 -1.53255 -1.405846
H  -3.314834 0.93381 -1.075411
