program: Gaussian 09
title: 000011331
version: EM64L-G09RevD.01
frameworkgroup: C1[X(C8H5Cl3O3)]
method: RPBEPBE
basis: SDD
operation: Freq
keyword: #p
keyword: freq=noraman
keyword: PBEPBE/SDD
title: #p freq=noraman PBEPBE/SDD
converged: NO YES NO NO
title: Mulliken charges:
elementType: Cl Cl Cl O O O C C C C C C C C H H H H H
charge: 0.000845 0.000874 -0.025472 -0.242192 -0.420419 -0.187864 0.552878 -0.235114 -0.235155 -0.227237 -0.227105 -0.087480 -0.333131 0.185922 0.286901 0.286902 0.258586 0.258658 0.389603
chargesum: 0.00000
title: Mulliken charges with hydrogens summed into heavy atoms:
elementType: Cl Cl Cl O O O C C C C C C C C
charge: 0.000845 0.000874 -0.025472 -0.242192 -0.030816 -0.187864 0.552878 -0.235114 -0.235155 0.059664 0.059796 -0.087480 0.184113 0.185922
polarizability: 1.78002560e+02 2.62463144e-02 1.31596752e+02 6.46546838e+00 -4.67852145e-02 6.60389600e+01
1716.lowfreq: -12.1486 -5.2601 -3.0255 -0.0021 0.0014 0.0016 19.1644 22.5451 39.1962
frequency: 19.0170 21.7700 39.1927 56.9046 113.6842 145.1530 158.3272 173.5716 196.0885 208.6174 255.7834 311.2531 348.0407 407.1529 412.3562 430.0291 492.7619 503.9773 540.2490 560.3766 571.0502 621.0678 694.9342 731.6192 753.9675 821.8191 853.1205 860.7198 872.3526 978.9580 991.8486 1043.1868 1058.4606 1105.8792 1179.6862 1197.0971 1228.8355 1258.6881 1341.2513 1370.8156 1371.3047 1426.4345 1445.8310 1553.1528 1573.3834 1706.7658 2985.9460 3046.1065 3188.8034 3190.1570 3528.6238
redmass: 11.6784 8.3867 15.4637 2.5863 12.4971 9.5037 15.0603 24.1794 4.9171 14.3492 12.4822 9.6398 32.4995 7.9942 10.8375 6.9960 1.8405 5.0270 6.4528 4.2410 4.5304 1.4624 9.0740 7.9335 11.2340 8.0127 1.4394 1.3615 4.1637 7.5242 1.9284 2.9390 2.7614 2.9500 1.5037 1.0760 3.6524 1.7134 5.7112 1.7458 4.6336 2.6925 1.1425 9.6219 8.0539 9.4286 1.0557 1.1051 1.0932 1.0940 1.0643
irintensity: 0.0609 2.9906 0.5326 4.4280 1.1627 0.8577 0.1549 0.1105 0.0012 0.1351 3.0602 0.0916 0.1305 5.4994 4.0943 28.2570 33.0764 0.0772 1.2022 8.4573 26.5945 132.3911 37.2420 34.7378 81.7875 31.4594 40.1174 0.0044 6.7868 223.5886 0.1576 174.9545 34.2937 22.7815 4.9383 1.3947 96.1793 10.4865 16.5962 2.2833 23.8605 241.8733 13.9227 64.5224 39.1121 226.1472 31.0702 6.2884 2.8696 0.8165 36.3109
temp: 298.150 k
press: 1.00000 atm
elementType: 17 17 17 8 8 8 6 6 6 6 6 6 6 6 1 1 1 1 1
symmnumber: 1
zpe: 298744.5 jmol-1
zpe.correction: 0.113786 hartree
zpe.thermalcorrener: 0.127927 hartree
zpe.thermalcorrenthalpy: 0.128871 hartree
zpe.thermalcorrgfe: 0.068756 hartree
zpe.sumelectzpe: -1912.656350 hartree
zpe.sumelectthermal: -1912.642209 hartree
zpe.sumelectthermalent: -1912.641265 hartree
zpe.sumelectthermalfe: -1912.701380 hartree
dipole: 0.0308 -0.0052 2.9954
dipole: 2.9956
quadrupole: -92.7999 -98.2152 -106.6584
quadrupole: 0.0463 -9.8006 0.0589
quadrupole: 6.4246 1.0093 -7.4339 0.0463 -9.8006 0.0589
hfenergy: -1912.770136 hartree
pointgroup: C01 [X(C8H5Cl3O3)]
dipole: -0.0002859 -0.005713 -1.178532 debye
dipolederiv: -0.2507531 -0.2536297 -0.0294722 -0.2591082 -0.5843564 -0.0515712 -0.0076503 -0.0276451 -0.03185 -0.2519761 0.2545717 -0.0317656 0.2602355 -0.5819982 0.055859 -0.0100633 0.0319549 -0.0324704 -0.8383034 -0.0014145 -0.0875019 -0.0015614 -0.1259915 0.0001281 -0.1089841 0.0000955 -0.0597878 -1.4137579 -0.0015321 0.1758945 -0.0025196 -0.3028839 -0.0000012 0.1668335 0.0006678 -0.259392 -0.9024955 0.0075255 0.5459928 0.0084095 -0.4198058 -0.005982 0.5405108 -0.0061454 -0.843837 -0.6993579 -0.0015571 -0.2346181 0.0019835 -0.2684137 -0.0071925 0.0320431 -0.0066019 -0.9131455 1.0623465 0.0020953 -0.0414331 0.0032134 -0.2937631 0.0016185 0.196857 0.0017692 0.0259438 0.3080134 0.3401716 0.0875987 0.4028029 0.8855987 0.0687176 0.0473331 0.033681 -0.0504651 0.3101131 -0.341381 0.0906662 -0.4039792 0.8824748 -0.0759991 0.0507819 -0.0409697 -0.0496359 -0.4549293 -0.1244056 -0.0367644 -0.1374243 -0.233927 -0.0214881 -0.043839 -0.0105173 -0.0699488 -0.4556976 0.1236234 -0.0378507 0.1362729 -0.2328052 0.0227261 -0.0448649 0.0117282 -0.0701782 1.2552638 0.0020901 0.1575558 0.0023401 0.2598168 -0.0009444 0.1781773 -0.0009078 -0.0407292 0.3844312 0.0017468 -0.2808538 0.0035793 0.3445858 -0.0004525 -0.7645913 -0.0012192 0.2678863 1.5363395 -0.0065762 -0.1552491 -0.0103624 0.1938963 0.0153531 -0.2363915 0.0148515 1.502932 0.0812211 0.0290348 -0.0107676 0.0300815 0.0507968 0.0048137 -0.0120933 0.0047538 0.1731086 0.0813957 -0.0290095 -0.0105119 -0.0300782 0.0505417 -0.0038949 -0.0118777 -0.0038363 0.1731699 0.0245966 -0.0244675 0.0014092 0.022923 -0.0069217 -0.098908 0.0887559 -0.0478491 0.0150222 0.0241204 0.0239539 0.0012448 -0.0253791 -0.0068471 0.0988977 0.0888178 0.0475809 0.0151323 0.1994296 -0.00084 -0.1035736 -0.0014292 0.3900026 -0.0016798 -0.1497551 -0.0013911 0.2482448 unknown
polarizability: 177.8615841|0.0134789|131.5964161|7.5873372|-0.153312|66.1802712 unknown
InChI: InChI=1S/C8H5Cl3O3/c9-4-1-5(10)8(6(11)2-4)14-3-7(12)13/h1-2,12H,3H2
charge 0 multiplicity 1
19 atoms
Cl -0.072649 2.782404 0.24435
Cl -0.063782 -2.778792 0.266043
Cl -4.829965 -0.008292 -0.390775
O  1.134631 0.004711 0.544981
O  4.308117 -0.015307 -1.240395
O  3.862926 0.013306 1.050001
C  -0.232132 0.001512 0.242709
C  -0.965108 1.210216 0.129133
C  -0.961193 -1.210427 0.138617
C  -2.359733 1.230868 -0.061733
C  -2.355762 -1.237021 -0.052054
C  -3.029756 -0.004518 -0.148334
C  2.023014 0.00272 -0.625665
C  3.457566 0.00022 -0.12209
H  -2.900728 2.176488 -0.13776
H  -2.893711 -2.184952 -0.120701
H  1.856612 -0.897205 -1.248804
H  1.860195 0.904056 -1.24803
H  5.255759 -0.013287 -0.936994
