program: Gaussian 09
title: 000141835
version: EM64L-G09RevD.01
frameworkgroup: C1[X(C7H16N2)]
method: RPBEPBE
basis: SDD
operation: Freq
keyword: #pfreq=noraman
keyword: PBEPBE/SDD
title: #p freq=noraman PBEPBE/SDD
converged: YES YES NO NO
title: Mulliken charges:
elementType: N N C C C C C C C H H H H H H H H H H H H H H H H
charge: -0.131379 -0.106675 0.323079 -0.388881 -0.456003 -0.662108 -0.754268 -0.626043 -0.651304 0.184111 0.224071 0.234771 0.223344 0.201494 0.222611 0.203871 0.225166 0.215372 0.232222 0.218443 0.225402 0.182970 0.195202 0.223602 0.240930
chargesum: 0.00000
title: Mulliken charges with hydrogens summed into heavy atoms:
elementType: N N C C C C C C C
charge: -0.131379 -0.106675 0.323079 0.019301 0.002112 -0.034132 -0.081508 0.000772 0.008430
polarizability: 8.87706317e+01 -2.00134956e+00 9.00536909e+01 1.30601337e-01 -5.71792172e-02 8.25024423e+01
1716.lowfreq: -22.6556 -10.9112 -0.0008 -0.0007 -0.0002 12.0894 24.5951 162.6044 166.5015
frequency: 19.0459 162.5714 166.3992 203.9937 222.1696 232.1411 266.0281 287.9960 317.2336 334.5351 365.0494 385.8620 455.4893 489.9112 555.1124 622.3543 636.4268 701.6671 834.3758 895.8600 914.1654 939.3769 977.4141 988.4394 1007.6562 1030.3579 1095.8474 1106.7014 1115.6474 1132.9317 1140.9029 1164.1888 1198.6919 1205.7531 1206.9161 1269.2444 1275.8826 1308.7335 1329.1564 1368.7942 1384.4230 1428.5334 1434.5618 1448.9935 1452.9064 1460.5674 1466.1252 1470.2493 1474.3889 1481.0349 1488.4210 1490.4159 1501.7244 2837.3500 2855.7288 2883.9247 2982.8014 2993.6228 2995.2288 3003.4145 3017.3434 3033.1134 3069.6164 3079.8933 3084.1119 3090.6763 3093.5007 3094.3860 3098.4807
redmass: 2.5671 2.2286 1.3136 1.1768 1.3521 1.2395 1.5753 1.2759 2.3187 2.7780 2.3592 2.2371 2.1506 3.0462 4.0354 2.8833 3.6392 2.7888 1.8089 2.6070 1.5145 2.0504 1.4213 2.0502 2.0218 1.6785 1.3429 1.5156 1.6629 1.5586 1.8828 1.7899 3.3763 2.3202 2.3205 3.7722 1.9045 1.2855 1.4247 1.2408 1.2176 1.1412 1.1446 1.0575 1.0593 1.0589 1.0531 1.0609 1.0635 1.0573 1.0647 1.0471 1.0741 1.0593 1.0704 1.0555 1.0351 1.0359 1.0834 1.0732 1.0675 1.0764 1.0974 1.1000 1.1014 1.1013 1.0987 1.1001 1.0994
irintensity: 0.1377 5.7178 1.5789 1.2745 1.6583 0.3849 0.5788 1.0043 0.7234 6.1409 0.1407 7.1621 1.9037 3.7247 8.1600 4.6248 2.6326 18.5396 6.2245 14.9506 3.6552 0.1187 2.5857 21.2087 23.7344 8.0262 1.8300 18.6677 8.5309 9.1894 21.7772 4.5996 69.5758 37.8445 4.3320 30.3284 27.4038 3.3087 2.6359 27.4144 22.8111 6.1598 2.7750 2.3456 5.6557 13.6700 22.1465 10.2403 8.7919 9.2716 7.4149 12.5601 3.5997 108.0436 84.7195 157.8604 25.2701 18.2598 37.5065 60.7400 74.3480 43.3540 25.1070 15.8937 4.9414 85.7577 33.3911 35.0181 27.0214
temp: 298.150 k
press: 1.00000 atm
elementType: 7 7 6 6 6 6 6 6 6 1 1 1 1 1 1 1 1 1 1 1 1 1 1 1 1
symmnumber: 1
zpe: 586927.2 jmol-1
zpe.correction: 0.223549 hartree
zpe.thermalcorrener: 0.234221 hartree
zpe.thermalcorrenthalpy: 0.235166 hartree
zpe.thermalcorrgfe: 0.187910 hartree
zpe.sumelectzpe: -385.046522 hartree
zpe.sumelectthermal: -385.035849 hartree
zpe.sumelectthermalent: -385.034905 hartree
zpe.sumelectthermalfe: -385.082161 hartree
dipole: -0.0957 -0.5346 -1.4921
dipole: 1.5879
quadrupole: -57.4187 -56.0830 -58.4148
quadrupole: -2.4890 -0.2674 -1.3439
quadrupole: -0.1132 1.2225 -1.1093 -2.4890 -0.2674 -1.3439
hfenergy: -385.2700709 hartree
pointgroup: C01 [X(C7H16N2)]
dipole: -0.0443272 0.1857193 0.5948413 debye
dipolederiv: -0.7246935 -0.0390474 0.1350493 0.0731629 -0.6276922 -0.1227561 0.0581658 -0.1080976 -0.6100564 -0.6587894 0.0502104 -0.0757605 0.1042192 -0.5211154 0.0011761 0.0329361 -0.0889462 -0.5040639 0.6470807 -0.080678 0.0049608 -0.1023098 0.7036866 0.2493377 -0.0140779 0.2702511 0.4899586 0.0647453 0.2843883 0.1592264 0.1573973 0.4325751 0.0164602 0.1682015 -0.003907 0.290249 0.190809 -0.0745335 -0.0118642 -0.0819324 0.3169291 -0.0564908 -0.0606465 -0.0508059 0.2730685 0.0180034 -0.0325512 -0.0332317 -0.0032548 0.0128453 -0.0578688 -0.0325222 -0.0855073 -0.1778431 0.0098286 -0.0136899 0.0193913 -0.0074482 -0.1391759 0.0733728 0.0207821 0.0962782 -0.0812647 0.3955345 -0.0440907 -0.1394098 -0.0082581 0.0644298 -0.0029094 -0.1623205 0.044447 0.525438 0.2620386 -0.0793025 0.0645313 -0.0897206 0.1130999 0.0171933 0.0845559 0.044173 0.3727553 0.0080988 -0.0729559 -0.0334715 -0.0637234 -0.0622654 -0.0512471 -0.0720173 -0.190035 -0.2217928 0.0143615 0.1069376 -0.0586503 0.0372082 -0.1726993 0.0864449 -0.0545521 0.1178141 0.001151 0.0577843 0.0489108 -0.0464936 0.0505371 0.0458853 0.0009416 0.0107681 0.0451967 -0.1863981 -0.0947909 -0.1130073 -0.0093909 -0.0992078 -0.0128591 -0.0085832 -0.0672254 -0.059389 0.0759916 -0.1571392 -0.0869024 -0.0508097 -0.0680601 0.0585319 -0.0315526 -0.0048454 -0.0094575 0.0650229 0.0841272 -0.0269323 0.0577636 -0.0355689 -0.015239 0.1454105 0.0305718 0.0977141 -0.0360239 0.0091925 0.1348805 0.0265788 0.1138432 -0.123116 -0.07661 0.0051387 -0.0322837 0.0595296 0.1053784 -0.0081731 -0.0145671 -0.0058044 0.0527947 -0.0833299 -0.0073847 -0.0469873 -0.1437391 -0.1152894 -0.1225447 -0.0163983 -0.075087 0.0637165 0.0016491 -0.054805 -0.0089279 0.0827693 -0.0101206 0.147417 0.0045138 0.1061005 -0.0378808 -0.0059112 0.0340986 -0.0131058 0.0846571 0.0211511 -0.1106685 0.0079822 -0.1822505 -0.0736076 0.0040604 0.0132247 -0.0327749 0.0570976 -0.0619619 0.123272 0.0067951 0.2011775 -0.0670303 0.0087854 -0.0015459 0.0457937 0.0444674 -0.0254584 -0.0143245 -0.0941696 0.0087405 0.0602385 -0.0386982 0.0883969 -0.0271827 -0.3346601 -0.0168611 0.078702 0.11191 0.0421652 0.0043089 -0.140967 -0.0132219 -0.0846403 -0.214753 -0.1430314 -0.0845406 -0.0169874 -0.1459077 0.0516157 -0.0222686 0.0303326 0.0178923 0.0644823 0.1200021 0.0292241 0.0025017 0.0739822 -0.1279764 0.0943609 -0.0320081 0.0624881 0.0239568 unknown
polarizability: 88.2832337|1.7870727|90.5273891|-0.2557746|0.1170459|82.5161421 unknown
InChI: InChI=1S/C7H16N2/c1-7(2)8(3)5-6-9(7)4/h5-6H2,1-4H3
charge 0 multiplicity 1
25 atoms
N  -1.043497 0.511103 -0.052568
N  1.273827 -0.15564 -0.170548
C  -0.132172 -0.711323 -0.215905
C  -0.214514 1.736208 -0.043082
C  1.112509 1.242608 -0.677259
C  -0.374784 -1.312674 -1.623639
C  -0.372663 -1.807358 0.843884
C  -2.160245 0.500745 0.895841
C  1.95133 -0.18332 1.150809
H  -0.038805 2.121048 0.993081
H  -0.682752 2.550914 -0.628945
H  1.025932 1.231325 -1.778265
H  1.983465 1.859804 -0.403133
H  -1.440476 -1.581805 -1.738861
H  -0.127966 -0.577607 -2.407578
H  0.248958 -2.212201 -1.776331
H  -0.31425 -1.422936 1.876294
H  -1.369933 -2.257223 0.69849
H  0.373308 -2.611983 0.721846
H  -2.755057 -0.422928 0.789413
H  -2.837718 1.347366 0.67361
H  -1.856334 0.594548 1.970315
H  1.422795 0.366433 1.966784
H  2.954148 0.264334 1.031663
H  2.095095 -1.22514 1.480185
