program: Gaussian 09
title: 000141830
version: EM64L-G09RevD.01
frameworkgroup: C1[X(C11H14)]
method: RPBEPBE
basis: SDD
operation: Freq
keyword: #p
keyword: freq=noraman
keyword: PBEPBE/SDD
title: #p freq=noraman PBEPBE/SDD
converged: YES YES NO NO
title: Mulliken charges:
elementType: C C C C C C C C C C C H H H H H H H H H H H H H H
charge: -0.213785 -0.213788 -0.530372 -0.371609 -0.371593 0.303004 -0.218938 -0.218952 0.126277 -0.784377 -0.784372 0.243831 0.243834 0.240034 0.239349 0.248530 0.248526 0.239006 0.239010 0.217557 0.220811 0.229825 0.220776 0.217592 0.229824
chargesum: 0.00000
title: Mulliken charges with hydrogens summed into heavy atoms:
elementType: C C C C C C C C C C C
charge: 0.030046 0.030046 -0.050989 -0.123078 -0.123068 0.303004 0.020068 0.020058 0.126277 -0.116183 -0.116180
polarizability: 1.25765679e+02 5.10840377e+00 9.93256330e+01 -2.12825643e-03 2.80731245e-03 1.00812395e+02
1716.lowfreq: -21.4356 0.0006 0.0006 0.0006 8.5052 18.3192 91.3802 112.4352 127.1787
frequency: 91.3800 112.4170 127.1620 172.7408 207.7097 276.1616 309.5297 359.8532 399.0545 421.3369 472.5069 499.1643 537.6307 644.7698 683.3412 712.5282 750.0401 808.7948 824.7724 825.4105 855.4818 896.1039 903.3456 914.9196 917.4854 947.0148 957.3857 965.6357 975.9928 1004.6683 1050.3166 1055.9611 1079.2088 1082.5681 1085.7113 1097.9439 1109.9250 1162.4173 1186.1420 1186.9474 1204.4750 1232.6119 1240.7436 1260.8390 1299.1136 1319.2570 1385.7951 1396.6661 1439.0491 1456.8103 1466.0140 1471.6061 1474.3018 1565.2590 1747.1645 2957.1082 2961.1087 3024.3813 3026.8186 3085.4319 3086.6871 3090.2310 3093.2106 3095.6408 3139.6177 3153.6044 3156.7004 3189.8038 3190.4112
redmass: 2.9287 1.6157 1.3631 1.1112 2.9755 2.7696 2.7943 2.3381 2.5739 3.2385 2.6298 3.3887 3.1058 3.5384 1.6763 5.1286 2.4804 1.8372 2.2515 3.6009 2.5647 2.4031 1.6227 3.0145 1.7844 1.3697 2.2729 2.1964 1.3918 1.4835 1.3104 1.2068 1.5799 1.2916 1.3402 1.6466 2.9821 1.7777 1.5814 1.4359 1.4236 1.9146 3.2917 1.5408 1.7310 2.0689 1.2538 1.2134 1.2007 1.0494 1.0485 1.0446 1.0701 5.8049 8.3706 1.0386 1.0384 1.0972 1.0966 1.0914 1.0559 1.0930 1.0933 1.0940 1.0891 1.0990 1.0871 1.1112 1.1118
irintensity: 1.9565 0.0030 0.0000 0.2759 0.0533 0.7379 0.2147 2.6305 1.9303 0.4899 4.1170 2.8437 3.3928 4.3221 46.8307 3.4323 14.1065 29.6043 12.6574 0.0923 9.8273 1.4154 2.4196 7.6297 0.0027 0.1380 2.3384 1.2983 0.8236 0.2828 0.6743 26.0119 2.1851 1.0156 3.4499 19.6971 0.0303 2.7491 5.1305 1.9265 0.0768 17.4014 1.7377 0.0064 11.4004 0.1551 29.2228 4.5815 12.3869 0.0617 12.9454 22.5264 4.1030 2.9793 0.4711 25.4017 84.2741 0.0010 54.0074 10.6174 26.1428 30.4199 64.3365 6.9240 15.7029 21.6289 9.6920 19.6930 30.6658
temp: 298.150 k
press: 1.00000 atm
elementType: 6 6 6 6 6 6 6 6 6 6 6 1 1 1 1 1 1 1 1 1 1 1 1 1 1
symmnumber: 1
zpe: 561538.7 jmol-1
zpe.correction: 0.213879 hartree
zpe.thermalcorrener: 0.224020 hartree
zpe.thermalcorrenthalpy: 0.224964 hartree
zpe.thermalcorrgfe: 0.178985 hartree
zpe.sumelectzpe: -426.653018 hartree
zpe.sumelectthermal: -426.642877 hartree
zpe.sumelectthermalent: -426.641933 hartree
zpe.sumelectthermalfe: -426.687912 hartree
dipole: 0.0926 0.1032 -0.0001
dipole: 0.1386
quadrupole: -63.0992 -67.4159 -64.0598
quadrupole: 0.8156 -0.0003 0.0012
quadrupole: 1.7591 -2.5576 0.7985 0.8156 -0.0003 0.0012
hfenergy: -426.8668966 hartree
pointgroup: C01 [X(C11H14)]
dipole: 0.0344368 0.0423029 0.0001294 debye
dipolederiv: 0.0800885 -0.0685169 -0.0694793 -0.02428 0.0510159 0.0232713 -0.0215057 0.0425394 -0.1621533 0.0801324 -0.0690067 0.0689225 -0.0244257 0.0514694 -0.0217682 0.0212823 -0.0410358 -0.1626236 0.0124974 0.0063652 0.0000235 -0.0369627 -0.2322923 -0.0008338 -0.0001278 -0.0008436 0.005173 0.0939114 -0.0312548 0.1601261 -0.1263598 -0.006159 -0.0051173 0.0129388 0.0116232 0.1320099 0.0938645 -0.0301365 -0.1603485 -0.126286 -0.0061148 0.0042076 -0.0138302 -0.0125772 0.1319949 0.1554488 0.1016346 0.0003151 0.1901012 -0.0918238 0.0000052 0.0006153 0.0000195 -0.1061698 -0.2557549 0.1480302 -0.0743732 0.1425931 0.0433272 0.0194974 0.0047098 0.1032636 -0.0310458 -0.2557335 0.1474729 0.0754903 0.1426212 0.0441502 -0.0190133 -0.0036369 -0.1027846 -0.031945 0.1997785 0.0223787 0.0000737 0.0408048 -0.1625061 -0.0013296 0.0001378 -0.0013604 0.2471966 -0.0316052 -0.0237061 0.0446642 -0.0154105 0.1288741 0.0107014 -0.0228658 -0.0030943 -0.1022479 -0.0315902 -0.0234708 -0.0448476 -0.0158344 0.1288741 -0.009169 0.0227415 0.0046818 -0.1022824 -0.1076698 0.0340749 0.1161099 0.0361932 0.048788 0.0549354 0.0682446 0.0257072 0.0197626 -0.1077243 0.034875 -0.1158295 0.03664 0.0493526 -0.0547457 -0.0679632 -0.0255093 0.0192486 -0.0287439 0.1243188 0.0004597 0.0964906 -0.1059936 -0.0009 0.0003592 -0.0008958 0.1482125 -0.0474036 -0.1180644 -0.0003923 -0.0797868 0.0600284 -0.0000832 -0.000257 -0.0000747 0.0875442 0.0311456 0.0108285 -0.1051874 0.0032897 0.0470535 -0.0060904 -0.0654295 0.0041504 -0.1316417 0.0311941 0.0100849 0.1052197 0.0028408 0.0470275 0.0073493 0.06541 -0.002896 -0.1316731 0.1124737 -0.1362945 0.050558 -0.1152134 -0.012593 0.0721826 0.0457879 0.0834572 0.0295126 0.1124513 -0.1359561 -0.0515411 -0.1149079 -0.0114898 -0.0724307 -0.0466162 -0.0836993 0.0284577 -0.0143178 -0.0978034 0.0382561 -0.1640485 -0.1016726 0.0333623 0.0444015 -0.026692 0.0727203 -0.1000004 0.1030537 0.0477228 0.164528 -0.0223852 -0.0243694 0.0468989 0.0332256 0.0722005 0.0459271 -0.0068588 -0.1485677 -0.0066294 0.0885992 -0.0218833 -0.0766051 -0.0067262 -0.0886224 -0.1003041 0.1033904 -0.0468984 0.1648616 -0.0220748 0.0235635 -0.045531 -0.0340056 0.0722255 -0.0141088 -0.0973626 -0.0389278 -0.1635945 -0.1018146 -0.0346203 -0.0456448 0.0253966 0.0726365 0.0460432 -0.0080761 0.1484514 -0.0072247 0.0883594 0.023278 0.0764855 0.0081303 -0.0884903 unknown
polarizability: 125.2151072|6.3521266|99.8762049|0.0176039|-0.001941|100.8123951 unknown
InChI: InChI=1S/C11H14/c1-6(2)11-7-3-4-8(11)10-5-9(7)10/h3-4,7-10H,5H2,1-2H3
charge 0 multiplicity 1
25 atoms
C  -1.614798 0.735858 0.772386
C  -1.615016 0.741237 -0.766809
C  -1.172045 2.000022 0.007129
C  -0.528664 -0.334604 1.144015
C  -0.529013 -0.326568 -1.146253
C  0.484916 -0.132491 -0.000568
C  -1.131639 -1.680738 0.677798
C  -1.131827 -1.675951 -0.689367
C  1.821681 0.096413 0.000005
C  2.632023 0.229129 -1.280211
C  2.632436 0.220444 1.280825
H  -2.54578 0.747886 1.346192
H  -2.546162 0.757239 -1.340247
H  -1.86586 2.848062 0.010176
H  -0.113465 2.278225 0.007934
H  -0.16167 -0.294328 2.178989
H  -0.162297 -0.27903 -2.18102
H  -1.539136 -2.445864 1.34368
H  -1.539522 -2.43639 -1.360476
H  3.161447 1.202635 -1.311867
H  3.412592 -0.556372 -1.333549
H  2.008178 0.150747 -2.185462
H  3.41389 -0.564569 1.327967
H  3.160774 1.194286 1.31951
H  2.00906 0.134624 2.185723
