program: Gaussian 09
title: 000141810
version: EM64L-G09RevD.01
frameworkgroup: C1[X(C13H12)]
method: RPBEPBE
basis: SDD
operation: Freq
keyword: #p
keyword: freq=noraman
keyword: PBEPBE/SDD
title: #p freq=noraman PBEPBE/SDD
converged: YES YES NO NO
title: Mulliken charges:
elementType: C C C C C C C C C C C C C H H H H H H H H H H H H
charge: -0.353021 -0.353023 -0.539803 0.340542 0.340542 -0.153997 -0.153997 -0.441019 -0.441019 -0.232780 -0.232780 -0.230174 -0.230174 0.240022 0.240022 0.240425 0.227118 0.207554 0.207553 0.240444 0.240443 0.196084 0.196085 0.222476 0.222477
chargesum: 0.00000
title: Mulliken charges with hydrogens summed into heavy atoms:
elementType: C C C C C C C C C C C C C
charge: -0.112999 -0.113001 -0.072260 0.340542 0.340542 0.053556 0.053556 -0.200575 -0.200575 -0.036696 -0.036695 -0.007697 -0.007697
polarizability: 1.48882522e+02 -8.61784350e-05 1.40195405e+02 1.21647239e+00 -2.13435364e-06 9.31885383e+01
1716.lowfreq: -7.8508 -0.0006 -0.0004 0.0006 13.0292 14.4969 99.1943 108.6552 189.9897
frequency: 99.1931 108.6477 189.9893 253.3871 331.4377 338.5684 383.5056 398.6828 436.8308 517.5117 538.9012 556.6022 564.5451 629.4494 691.5564 738.7102 750.2669 759.6380 777.0351 782.0733 824.9481 865.4556 865.8134 886.5777 902.0000 902.9971 948.6270 967.2535 983.6085 985.7108 1012.0331 1021.3517 1045.3968 1070.7220 1073.8776 1147.1182 1158.5302 1169.3632 1190.2789 1203.2965 1236.3548 1238.8469 1254.2338 1284.5475 1301.3088 1315.4127 1320.4197 1377.6758 1385.1421 1413.0020 1443.8052 1462.7132 1474.0324 1588.3614 1609.1737 1617.7938 1635.5170 3006.2425 3018.9988 3028.7456 3079.7593 3087.5685 3090.1773 3109.9988 3118.0973 3124.0366 3125.7030 3138.8338 3158.2284
redmass: 4.5420 3.5068 3.0385 3.4403 3.0928 4.6195 2.5491 3.9573 3.4151 3.0756 3.5435 4.4678 3.2591 4.2550 2.0077 2.5776 3.4064 1.4299 1.9048 2.7634 3.3534 1.8562 3.6632 2.0862 3.7206 2.5189 1.4452 1.2920 1.3182 1.3090 2.0390 2.2155 1.8108 3.0040 1.9021 1.4361 1.4608 1.0755 1.2759 1.5044 1.1070 1.3973 1.7337 1.5013 1.6257 1.3049 1.4622 1.3468 6.7045 1.5776 2.3773 1.8433 1.3690 6.7630 6.9011 8.5947 5.4340 1.0682 1.0846 1.0808 1.0820 1.1011 1.0875 1.0954 1.0851 1.0952 1.0916 1.0946 1.1003
irintensity: 0.7521 0.0002 0.1573 2.4309 0.2818 0.1771 3.7059 0.2457 6.4631 8.5089 0.0729 0.2356 4.7903 0.9824 78.2631 41.5202 0.0231 58.4757 2.2562 9.6242 2.1810 1.3007 5.4776 0.1100 4.5783 6.4193 2.1097 1.9298 0.0402 0.0999 20.3296 2.4640 0.1050 1.3755 1.0982 4.8737 0.7069 0.1610 0.3261 0.5900 2.7008 0.7584 2.2828 0.1248 0.3284 4.4246 3.7251 5.5251 1.7936 3.5854 4.0415 6.9915 22.1338 0.1974 0.0413 6.6610 0.0002 7.7338 34.8714 58.3140 0.0182 21.3680 10.0357 55.6173 3.2213 36.3003 21.8713 35.1993 34.6458
temp: 298.150 k
press: 1.00000 atm
elementType: 6 6 6 6 6 6 6 6 6 6 6 6 6 1 1 1 1 1 1 1 1 1 1 1 1
symmnumber: 1
zpe: 544996.0 jmol-1
zpe.correction: 0.207578 hartree
zpe.thermalcorrener: 0.216989 hartree
zpe.thermalcorrenthalpy: 0.217933 hartree
zpe.thermalcorrgfe: 0.173146 hartree
zpe.sumelectzpe: -501.642855 hartree
zpe.sumelectthermal: -501.633443 hartree
zpe.sumelectthermalent: -501.632499 hartree
zpe.sumelectthermalfe: -501.677287 hartree
dipole: 0.1132 0.0000 0.2822
dipole: 0.3041
quadrupole: -74.7969 -67.6903 -76.7168
quadrupole: 0.0000 0.2879 0.0000
quadrupole: -1.7289 5.3777 -3.6488 0.0000 0.2879 0.0000
hfenergy: -501.8504326 hartree
pointgroup: C01 [X(C13H12)]
dipole: 0.0411047 -0.0000016 0.112362 debye
dipolederiv: -0.061574 -0.0081717 0.0227137 -0.1093914 0.0954891 0.0924388 0.0781529 0.1895465 0.1610717 -0.0615626 0.0081777 0.0227088 0.1093938 0.0954918 -0.0924429 0.0781491 -0.1895547 0.1610618 0.0480242 -0.0000027 0.0104005 -0.0000046 -0.0226746 -0.000004 0.0726722 -0.0000038 0.0408111 0.1907162 0.0523173 0.043987 0.2099275 -0.0373678 0.0702139 0.0667806 -0.0423839 -0.1131719 0.1906993 -0.0523298 0.0439826 -0.2099414 -0.0373555 -0.0702126 0.0667716 0.0423843 -0.1131738 -0.0497085 -0.0587355 -0.2057968 0.0733026 -0.004391 -0.0639508 -0.3401509 -0.0994213 -0.0307008 -0.0497118 0.058743 -0.205792 -0.0732868 -0.0043979 0.0639617 -0.3401469 0.0994411 -0.0306955 -0.1074367 -0.0158301 0.0405175 -0.0364682 0.116589 -0.0077726 0.0135214 -0.0344026 -0.1272271 -0.1074321 0.0158386 0.0405192 0.0364784 0.1165862 0.0077813 0.0135254 0.0344119 -0.1272246 -0.1526695 0.122396 -0.0923559 0.0775609 0.0829267 -0.0863375 -0.0796477 -0.1405287 -0.0207945 -0.1526755 -0.1223803 -0.0923574 -0.077546 0.0829308 0.0863452 -0.0796441 0.1405351 -0.0207873 -0.0056147 -0.051212 0.0690516 -0.0700597 -0.0087634 -0.0408036 0.0619303 -0.0122983 -0.1302898 -0.0056095 0.0512097 0.0690558 0.0700579 -0.0087732 0.0408056 0.061932 0.0122999 -0.1302887 0.046168 0.0246175 0.0121144 -0.0086676 -0.1001955 -0.1052495 -0.0051993 -0.0982262 -0.023001 0.0461663 -0.0246233 0.0121178 0.0086616 -0.1002008 0.1052454 -0.0051946 0.0982249 -0.0229939 -0.1594729 0.0000071 -0.0865392 0.0000066 0.0517604 0.0000027 -0.0220483 0. 0.0793865 0.0664339 -0.0000025 0.1207158 -0.0000014 0.0652707 0.0000027 0.0726292 0.0000031 -0.1466769 0.0947166 -0.0050208 0.0634955 -0.0523011 -0.1320535 0.0544366 0.0859417 0.0428767 0.0686483 0.0947182 0.0050085 0.0634941 0.0522877 -0.1320526 -0.0544474 0.0859418 -0.0428896 0.0686449 0.0944232 -0.0292862 -0.0240371 0.0201063 -0.1091514 -0.000059 -0.0281202 -0.0047511 0.1339189 0.0944236 0.0292772 -0.024036 -0.0201154 -0.109153 0.0000499 -0.0281214 0.0047415 0.1339186 0.047677 -0.0454029 0.132714 -0.0387266 0.0165541 0.0540269 0.1742433 0.0837792 -0.0284568 0.0476802 0.0453963 0.1327134 0.0387181 0.0165561 -0.0540307 0.1742403 -0.0837853 -0.0284608 -0.0741849 0.0886304 -0.0846909 0.0929806 0.0331818 0.0344785 -0.0890773 0.0345511 0.123242 -0.0741939 -0.0886217 -0.0846966 -0.0929718 0.0331935 -0.0344786 -0.0890809 -0.0345499 0.1232397 unknown
polarizability: 148.754971|-0.0003629|140.1954049|2.9270038|0.0008921|93.3160892 unknown
InChI: InChI=1S/C13H12/c1-2-6-11-9-10(5-1)12-7-3-4-8-13(11)12/h1-8,10-11H,9H2
charge 0 multiplicity 1
25 atoms
C  0.714541 1.23256 0.8964
C  0.714481 -1.232619 0.896348
C  1.233061 -0.000056 1.698928
C  -0.627776 0.712057 0.365035
C  -0.62781 -0.712029 0.365007
C  1.620979 1.605646 -0.274058
C  1.620905 -1.605701 -0.274122
C  -1.742778 1.426876 -0.114469
C  -1.742849 -1.426771 -0.114528
C  2.296014 0.735561 -1.092941
C  2.29598 -0.735615 -1.092971
C  -2.87074 0.708174 -0.582245
C  -2.870773 -0.707994 -0.582279
H  0.586747 2.117318 1.546081
H  0.586649 -2.117393 1.545998
H  2.329051 -0.000089 1.819795
H  0.762814 -0.000069 2.699793
H  1.718216 2.679993 -0.486078
H  1.718095 -2.680044 -0.486185
H  -1.746146 2.523125 -0.120345
H  -1.746271 -2.52302 -0.12045
H  2.901798 1.187823 -1.89142
H  2.901745 -1.187872 -1.891466
H  -3.752888 1.250879 -0.940936
H  -3.752946 -1.250642 -0.940994
