program: Gaussian 09
title: 000141804
version: EM64L-G09RevD.01
frameworkgroup: C1[X(C22H28O)]
method: RPBEPBE
basis: SDD
operation: Freq
keyword: #pfreq=noraman
keyword: PBEPBE/SDD
title: #p freq=noraman PBEPBE/SDD
converged: YES YES NO NO
title: Mulliken charges:
elementType: O C C C C C C C C C C C C C C C C C C C C C C H H H H H H H H H H H H H H H H H H H H H H H H H H H H
charge: -0.444583 0.134108 -0.080216 -0.046129 0.261508 0.478466 -0.737099 -0.717109 0.362907 -0.721195 0.625210 -0.254053 -0.646084 -0.274515 -0.385533 -0.416843 -0.708379 -0.705181 -0.697009 -0.697336 -0.243400 -0.231847 -0.245620 0.207016 0.225080 0.238138 0.253343 0.217258 0.197371 0.256351 0.214781 0.226787 0.338443 0.210874 0.247022 0.272094 0.216489 0.208707 0.222617 0.228614 0.215135 0.214287 0.210639 0.211522 0.228095 0.226547 0.212001 0.211455 0.226260 0.225258 0.227747
chargesum: 0.00000
title: Mulliken charges with hydrogens summed into heavy atoms:
elementType: O C C C C C C C C C C C C C C C C C C C C C C
charge: -0.106139 0.134108 -0.080216 -0.046129 0.261508 0.478466 -0.066866 -0.049137 0.362907 -0.464844 0.625210 -0.039272 -0.419297 -0.063641 -0.138511 -0.144749 -0.060566 -0.047145 -0.046752 -0.047333 -0.017140 -0.006588 -0.017874
chargesum: 0.00002
polarizability: 2.98987674e+02 -4.01748783e+00 2.27759873e+02 -4.70145146e+00 -1.04297138e+01 1.91520855e+02
1716.lowfreq: -5.9261 -2.8575 -1.1499 -0.1869 -0.0071 5.1499 5.9335 24.6938 31.5183
frequency: 3.3845 24.5772 31.5060 45.7491 58.0245 73.4451 106.3657 113.4051 117.4985 137.9454 175.7881 184.1912 208.3614 211.5072 218.0642 222.6592 233.0362 238.0990 239.5587 247.4282 255.5783 259.1696 278.9878 294.2256 301.6831 322.8239 352.1114 359.6769 362.5242 405.6123 409.1936 440.2065 458.0155 504.6410 529.3054 541.3106 562.0087 611.7801 615.6515 625.1366 630.5057 656.6428 668.4837 709.6191 747.2433 779.0782 795.5909 816.1211 841.4977 863.3801 891.9735 893.9565 903.1665 915.4161 917.9074 918.1248 934.1340 939.6388 941.1232 954.4612 955.1875 966.7936 981.0688 986.8139 989.2834 998.7440 1001.7695 1028.2381 1045.3643 1075.4222 1089.7542 1106.6054 1112.7016 1114.1378 1138.4454 1155.9812 1157.6123 1171.0993 1178.6946 1185.6690 1193.2374 1209.7522 1226.0239 1251.2639 1270.6097 1284.9209 1308.1194 1308.5964 1313.7074 1323.5940 1334.2951 1375.1446 1375.6009 1376.2642 1377.9456 1391.3956 1393.2247 1395.4255 1400.2709 1430.0123 1434.7182 1454.2543 1460.1933 1461.8259 1465.2781 1466.3322 1466.8200 1468.7169 1474.2766 1477.9129 1478.4263 1479.8854 1482.7697 1487.5172 1488.7790 1586.9954 1597.5445 1610.2244 1628.3857 2971.8203 2973.1512 2975.4907 2975.6581 2975.8224 2977.1677 2977.5338 2981.2199 3065.5755 3065.7080 3066.6857 3071.6481 3072.2514 3073.3792 3074.1920 3076.1734 3078.3402 3080.5319 3082.9085 3109.3762 3111.3947 3120.2777 3124.0899 3127.4670 3139.8973 3149.0084 3162.4226 3540.7031
redmass: 2.7223 3.3838 3.1324 3.8332 3.8919 3.2139 3.7252 3.1272 3.1350 3.3309 2.1046 1.2340 1.9185 1.1068 1.1226 3.5047 1.5421 1.7485 1.4523 1.3439 1.4606 2.1149 1.8260 2.7152 2.7803 3.1805 3.0190 3.4464 3.1840 2.9241 3.6332 3.1430 3.1815 3.6998 3.9554 4.9280 2.8573 3.3547 6.1132 3.9892 3.0375 3.6736 5.2672 1.8894 2.0831 3.4982 3.7031 3.1364 3.0379 1.2504 2.5387 1.6196 1.4948 1.2994 1.2543 2.4970 2.0751 1.7285 1.5519 1.4535 1.4573 3.6924 1.9840 1.3909 5.8413 1.3681 1.5367 2.1014 1.6215 1.7605 1.5932 1.9077 2.5796 2.4855 1.9398 2.0079 2.6497 1.0549 1.8641 1.1494 4.3113 1.9776 2.0829 1.6754 2.2844 2.5140 1.3330 1.3242 1.3532 2.5892 1.7030 1.2299 1.1973 1.2021 6.9287 1.2104 1.3667 1.2252 2.3678 2.8904 2.3681 1.0615 2.0577 1.0540 1.0746 1.0533 1.0858 1.0579 1.0866 1.1108 1.7860 1.0560 1.1349 1.0880 1.1494 6.1911 7.7831 6.0890 8.0358 1.0350 1.0348 1.0386 1.0370 1.0737 1.0470 1.0764 1.0371 1.0993 1.1000 1.1002 1.0983 1.0992 1.0999 1.0998 1.1004 1.0994 1.0996 1.0995 1.0983 1.0890 1.0844 1.0921 1.0875 1.0923 1.0956 1.1013 1.0657
irintensity: 0.1280 0.0773 0.0293 0.3742 0.3861 0.5030 0.1111 0.2367 0.1231 0.0545 0.1527 0.3005 0.2931 0.0588 0.0679 0.7526 3.4798 9.8150 2.3904 5.7682 36.7145 17.4947 63.5974 4.6319 10.1659 7.1829 3.9651 16.5896 1.7164 1.4825 4.6859 3.8269 0.9140 2.0778 7.4103 7.3514 3.1648 4.5124 0.2634 0.2802 3.2695 5.4580 3.1986 38.7032 78.8354 7.4474 5.1316 2.3889 9.2547 0.3726 11.0734 13.7474 4.5617 0.1813 5.7227 2.3720 8.1612 4.6533 5.8886 0.3301 1.3236 60.0003 22.3485 1.8496 1.0765 3.1582 10.4458 9.8537 22.0696 12.6025 22.0249 1.8571 1.3337 1.0451 16.7470 9.5161 9.4417 0.0169 6.0222 7.0873 1.6459 34.3625 10.2720 19.9214 22.4570 18.2974 0.4574 1.6904 0.7115 1.8114 4.7040 8.5739 1.3520 40.6062 1.1232 16.8148 0.8555 10.9887 20.6064 6.1358 11.3317 5.4105 7.9350 2.1974 1.1760 3.1661 1.3271 5.3194 5.6216 13.2720 8.9406 15.0673 32.7690 8.3245 18.5125 1.1138 34.7573 4.5303 16.0074 30.4968 34.5819 32.0494 17.0948 40.7813 35.6569 8.4754 47.1256 2.2723 0.6311 2.6661 32.4619 163.3936 39.3007 37.6773 23.8552 47.7279 39.5263 26.1609 21.2370 26.4083 1.8969 17.5050 2.9625 19.8549 26.2823 27.5946 6.5127
temp: 298.150 k
press: 1.00000 atm
elementType: 8 6 6 6 6 6 6 6 6 6 6 6 6 6 6 6 6 6 6 6 6 6 6 1 1 1 1 1 1 1 1 1 1 1 1 1 1 1 1 1 1 1 1 1 1 1 1 1 1 1 1
symmnumber: 1
zpe: 1140925.5 jmol-1
zpe.correction: 0.434556 hartree
zpe.thermalcorrener: 0.459116 hartree
zpe.thermalcorrenthalpy: 0.460060 hartree
zpe.thermalcorrgfe: 0.378590 hartree
zpe.sumelectzpe: -928.634746 hartree
zpe.sumelectthermal: -928.610186 hartree
zpe.sumelectthermalent: -928.609242 hartree
zpe.sumelectthermalfe: -928.690712 hartree
dipole: 0.1771 1.2735 -0.8903
dipole: 1.5639
quadrupole: -128.2762 -134.7066 -141.1583
quadrupole: -2.4567 -1.0062 2.0629
quadrupole: 6.4375 0.0071 -6.4446 -2.4567 -1.0062 2.0629
hfenergy: -929.069302 hartree
pointgroup: C01 [X(C22H28O1)]
dipole: -0.0300839 -0.5141113 -0.3367207 debye
polarizability: 299.0291855|0.695371|228.1092322|5.9027506|9.7178659|191.1299833 unknown
InChI: InChI=1S/C22H28O/c1-14(2)16-12-18(15(3)4)20-19(13-16)21(5,6)22(20,23)17-10-8-7-9-11-17/h7-15,23H,1-6H3
charge 0 multiplicity 1
51 atoms
O  1.477215 0.71636 2.187809
C  0.579469 2.116274 0.264514
C  1.171131 0.65648 0.742224
C  -0.22814 0.101995 0.409151
C  -0.733537 1.34851 -0.008831
C  -1.006419 -1.07164 0.434403
C  1.249252 2.722294 -0.984131
C  0.490768 3.15065 1.403186
C  2.370236 0.106959 -0.021442
C  -2.051918 1.508484 -0.455942
C  -2.874976 0.343989 -0.456688
C  -0.469496 -2.407802 0.951742
C  -2.347644 -0.903026 -0.012904
C  -4.330554 0.439739 -0.930743
C  2.215289 -0.744287 -1.144875
C  3.683006 0.474054 0.379983
C  -0.753193 -3.586329 -0.013576
C  -1.030734 -2.706403 2.37025
C  -5.332484 0.088562 0.201662
C  -4.586792 -0.438576 -2.184866
C  3.343375 -1.219993 -1.850606
C  4.810643 -0.000727 -0.324207
C  4.645689 -0.850931 -1.443242
H  0.658179 3.585957 -1.342711
H  2.269573 3.079317 -0.751263
H  1.324738 1.991419 -1.807837
H  0.016464 2.721265 2.2992
H  1.498321 3.502289 1.690062
H  -0.099893 4.024774 1.067451
H  -2.458915 2.471042 -0.787838
H  0.631784 -2.310555 1.039359
H  -3.012519 -1.776437 -0.019555
H  1.80225 -0.178142 2.467712
H  -4.515303 1.493982 -1.220977
H  1.20705 -1.029195 -1.467089
H  3.807163 1.130938 1.247676
H  -0.299246 -4.518184 0.371341
H  -1.838742 -3.764982 -0.12432
H  -0.337914 -3.390181 -1.018875
H  -0.811273 -1.878344 3.068414
H  -2.128718 -2.834928 2.336836
H  -0.590338 -3.635525 2.778421
H  -5.216292 -0.962695 0.524938
H  -6.37418 0.22132 -0.145993
H  -5.176581 0.732439 1.085863
H  -3.902656 -0.16692 -3.008867
H  -5.626703 -0.31428 -2.540761
H  -4.4333 -1.509974 -1.95761
H  3.2064 -1.878788 -2.715825
H  5.816959 0.291685 -0.002593
H  5.520706 -1.221033 -1.989432
