program: Gaussian 09
title: 000141762
version: EM64L-G09RevD.01
frameworkgroup: C1[X(C6H6)]
method: RPBEPBE
basis: SDD
operation: Freq
keyword: #p
keyword: freq=noraman
keyword: PBEPBE/SDD
title: #p freq=noraman PBEPBE/SDD
converged: YES YES NO NO
title: Mulliken charges:
elementType: C C C C C C H H H H H H
charge: -0.542616 -0.231767 0.228505 0.159646 -0.593701 -0.494167 0.241313 0.247291 0.243007 0.232538 0.234657 0.275294
chargesum: 0.00000
title: Mulliken charges with hydrogens summed into heavy atoms:
elementType: C C C C C C
charge: -0.054012 0.011240 0.228505 0.159646 -0.126505 -0.218873
polarizability: 1.07544138e+02 -1.92622224e+00 4.34877086e+01 1.18905637e+01 6.00712764e-01 3.89370429e+01
1716.lowfreq: -7.1786 -2.4628 -0.0003 0.0004 0.0005 6.0159 51.1987 151.6713 203.8250
frequency: 51.1839 151.6704 203.8245 311.0241 330.2151 445.1131 522.6484 578.3582 636.8674 649.4043 859.8979 879.5558 901.9422 943.1799 998.7160 1001.6625 1129.6906 1182.1813 1272.1993 1337.4607 1440.6431 1451.0751 2007.8576 2141.2498 2972.0749 3046.2337 3077.1478 3106.4618 3170.6296 3427.2905
redmass: 3.3600 2.8669 3.6228 2.6284 2.4561 3.0147 4.0812 1.8702 1.2317 1.2308 1.4187 1.3043 1.6549 3.8311 1.4882 3.0863 1.7004 1.1509 1.3026 1.4542 1.3892 1.0924 9.8334 6.0302 1.0638 1.0951 1.0606 1.0893 1.1131 1.1589
irintensity: 0.0517 1.3706 0.3768 3.5217 14.7117 6.0489 10.8054 7.9311 78.9121 77.3754 11.3249 92.2722 20.7934 4.8504 0.7391 2.0244 0.6888 1.3356 8.7531 1.2957 8.3076 12.6818 42.6546 8.4633 18.8814 6.7581 3.4875 7.0167 6.5208 67.0128
temp: 298.150 k
press: 1.00000 atm
elementType: 6 6 6 6 6 6 1 1 1 1 1 1
symmnumber: 1
zpe: 240613.6 jmol-1
zpe.correction: 0.091645 hartree
zpe.thermalcorrener: 0.098589 hartree
zpe.thermalcorrenthalpy: 0.099533 hartree
zpe.thermalcorrgfe: 0.060831 hartree
zpe.sumelectzpe: -231.673979 hartree
zpe.sumelectthermal: -231.667035 hartree
zpe.sumelectthermalent: -231.666091 hartree
zpe.sumelectthermalfe: -231.704794 hartree
dipole: -0.5113 0.4456 -0.1400
dipole: 0.6925
quadrupole: -31.3921 -34.5729 -36.2835
quadrupole: -1.2012 1.9899 0.0321
quadrupole: 2.6908 -0.4901 -2.2007 -1.2012 1.9899 0.0321
hfenergy: -231.7656241 hartree
pointgroup: C01 [X(C6H6)]
dipole: -0.195909 -0.1514231 0.1137043 debye
dipolederiv: 0.2082883 0.0200058 -0.0084313 0.0749343 0.1866513 0.0004147 0.0886882 -0.0193177 0.101056 -0.1260265 -0.04316 0.1115617 -0.0675595 -0.2390697 0.0338824 0.2211206 0.037827 0.1467415 0.140892 0.1097522 -0.0973065 0.1631194 -0.016906 -0.0249425 -0.1960785 -0.0126971 -0.0706682 0.435705 -0.1908578 -0.1906107 -0.2454162 -0.0551241 0.0593097 -0.2933969 0.056663 -0.0921453 -0.3635995 0.1248486 -0.0633155 0.181375 0.0994923 -0.0512771 -0.0086919 -0.0583985 -0.3921801 -0.574686 -0.0269857 0.0233349 -0.1170576 -0.3495492 0.0024857 0.0736619 0.0065308 -0.3427925 -0.0490156 0.0279391 -0.0060929 0.0191525 -0.1116046 0.0355428 -0.051055 0.0199578 0.115396 0.0127164 -0.0222689 0.0774322 -0.0265763 0.0991019 -0.0552476 0.0288294 -0.02844 -0.0592758 0.0433148 0.0512804 0.0373447 0.0532736 0.1634105 -0.031366 -0.0188168 -0.0314724 -0.0495509 -0.0212438 -0.0594561 0.0641757 -0.0689917 0.0293403 0.0291975 0.071449 0.0262247 0.187817 0.0581842 0.0391948 0.0383129 0.0588943 -0.0560193 -0.0069018 0.0615151 -0.0048798 0.1963355 0.2354707 -0.0302923 0.0135949 -0.0251477 0.2502768 0.0089022 0.022775 0.008002 0.2592667 unknown
polarizability: 106.557673|-1.3925161|43.3887917|-14.4847764|-0.8700398|40.0224243 unknown
InChI: InChI=1S/C6H6/c1-3-5-6-4-2/h1,6H,2,5H2
charge 0 multiplicity 1
12 atoms
C  0.601998 -0.674741 0.477716
C  -0.55224 -0.422662 -0.501191
C  1.843621 0.019248 0.080558
C  -1.760325 -0.004956 -0.133873
C  -2.963788 0.41961 0.241595
C  2.878751 0.595262 -0.263049
H  0.804115 -1.764539 0.525633
H  0.302155 -0.360795 1.493874
H  -0.337156 -0.614299 -1.56158
H  -3.762121 -0.28164 0.515783
H  -3.204454 1.489528 0.283869
H  3.779743 1.100784 -0.558935
