program: Gaussian 09
title: 000141736
version: EM64L-G09RevD.01
frameworkgroup: C1[X(C16H12O2)]
method: RPBEPBE
basis: SDD
operation: Freq
keyword: #pfreq=noraman
keyword: PBEPBE/SDD
title: #p freq=noraman PBEPBE/SDD
converged: YES YES NO YES
title: Mulliken charges:
elementType: O O C C C C C C C C C C C C C C C C H H H H H H H H H H H H
charge: -0.178934 -0.178933 -0.425558 -0.425556 -0.445980 -0.445980 0.317187 0.317183 -0.203096 -0.203098 -0.270690 -0.270688 0.277578 0.277578 -0.376834 -0.376834 -0.229481 -0.229480 0.283925 0.283925 0.239358 0.238237 0.238236 0.239357 0.243840 0.243840 0.290366 0.290366 0.240082 0.240082
chargesum: 0.00000
title: Mulliken charges with hydrogens summed into heavy atoms:
elementType: O O C C C C C C C C C C C C C C C C
charge: -0.178934 -0.178933 -0.141632 -0.141631 0.031615 0.031614 0.317187 0.317183 0.040744 0.040742 -0.270690 -0.270688 0.277578 0.277578 -0.086468 -0.086468 0.010601 0.010602
polarizability: 2.28731225e+02 2.08833896e-04 1.89537663e+02 3.34733085e+00 -2.59846485e-05 9.58971728e+01
1716.lowfreq: -12.0398 -0.0008 -0.0006 -0.0002 2.8447 4.0492 50.7057 86.2611 108.2163
frequency: 50.7013 86.2427 108.2134 126.7965 186.9782 198.3051 219.3890 268.9268 269.0562 362.5804 384.3674 401.9039 413.7670 429.9768 475.5243 478.8249 482.0718 528.8523 611.7230 627.6067 652.3297 674.7133 681.3512 710.2614 727.3013 731.6856 799.4571 801.2960 816.0480 824.9834 847.1913 865.6761 897.9619 908.1896 929.6249 937.1144 943.8410 960.5183 995.5660 1002.6248 1013.0189 1025.0258 1030.7611 1079.2738 1098.4431 1109.2870 1138.1356 1151.0577 1157.0859 1168.1422 1174.1873 1215.3998 1222.2372 1249.2603 1273.3960 1279.1749 1287.7516 1305.6876 1323.9711 1331.6247 1378.9302 1394.7784 1438.4715 1464.9341 1467.3944 1478.6352 1526.1218 1541.4625 1576.2340 1599.8080 1607.3184 1635.8007 3006.5184 3021.0923 3064.4519 3086.9387 3090.0372 3093.1624 3136.3850 3146.9974 3150.2099 3160.1277 3170.8654 3178.7458
redmass: 6.0525 4.1563 6.3461 5.0984 2.8414 5.4581 2.4644 4.1690 6.6817 10.7524 5.2775 3.5751 3.1288 5.7279 5.8530 6.3813 4.3987 5.2780 4.6805 7.0597 4.5573 7.0384 3.3262 1.9673 4.8913 2.4577 6.1031 1.7188 1.5392 3.0003 3.0163 2.8743 3.9678 4.1535 1.4455 1.9122 2.7228 1.9178 1.4161 4.4774 1.3624 2.5913 2.1441 2.9196 3.0866 1.0925 1.0867 1.9958 1.1455 1.8459 1.1448 1.3602 1.1660 1.6205 1.8150 1.8067 1.2815 2.6725 1.7148 1.9933 3.2210 9.6894 2.4857 1.0793 2.7417 1.0936 10.7065 10.5658 6.9895 6.4193 6.7057 7.9425 1.0581 1.0615 1.1051 1.1061 1.0872 1.0886 1.0861 1.0864 1.0900 1.0946 1.1005 1.1064
irintensity: 5.8608 0.0373 2.6252 0.0044 0.8252 0.2174 0.5878 3.5553 0.0003 17.8077 0.0454 0.1729 0.7340 0.0072 2.8360 3.0170 0.4542 0.2687 0.6074 11.8629 0.0536 0.0004 8.3333 33.6229 0.0333 96.4269 1.1891 37.9900 14.3869 39.3001 2.7913 0.0966 20.9173 0.1104 0.0002 0.0331 5.2669 0.8343 3.1420 8.9334 0.0023 0.5164 0.7350 0.6193 5.0860 4.7988 39.7762 5.3082 2.7334 12.8675 0.5701 9.2056 0.0509 11.7360 140.6836 0.2821 0.0038 146.8617 15.0623 69.7470 15.2531 0.3518 0.0695 7.6430 2.8004 3.8517 4.5185 279.1648 46.8617 48.9925 1.2001 31.4987 24.3722 50.0834 0.1463 40.1934 11.9476 6.7451 3.5876 3.1641 4.2204 2.1848 30.1244 23.7798
temp: 298.150 k
press: 1.00000 atm
elementType: 8 8 6 6 6 6 6 6 6 6 6 6 6 6 6 6 6 6 1 1 1 1 1 1 1 1 1 1 1 1
symmnumber: 1
zpe: 612894.1 jmol-1
zpe.correction: 0.233439 hartree
zpe.thermalcorrener: 0.246578 hartree
zpe.thermalcorrenthalpy: 0.247522 hartree
zpe.thermalcorrgfe: 0.193913 hartree
zpe.sumelectzpe: -766.097036 hartree
zpe.sumelectthermal: -766.083897 hartree
zpe.sumelectthermalent: -766.082953 hartree
zpe.sumelectthermalfe: -766.136562 hartree
dipole: -0.1256 0.0000 0.3965
dipole: 0.4159
quadrupole: -80.2035 -115.6543 -103.2768
quadrupole: 0.0000 0.2970 0.0001
quadrupole: 19.5080 -15.9428 -3.5653 0.0000 0.2970 0.0001
hfenergy: -766.3304754 hartree
pointgroup: C01 [X(C16H12O2)]
dipole: -0.0482846 0.0000257 0.1563344 debye
polarizability: 228.772937|0.0008956|189.5376598|2.3795127|-0.0171524|95.8554637 unknown
InChI: InChI=1S/C16H12O2/c17-15-11-3-1-2-4-12(11)16(18)14-10-7-5-9(6-8-10)13(14)15/h1-5,7,9-10H,6,8H2
charge 0 multiplicity 1
30 atoms
O  0.322091 -2.758145 0.021804
O  0.322066 2.758223 0.020783
C  -2.288661 -1.304825 -0.052404
C  -2.288675 1.304843 -0.052883
C  -2.9820 -0.779735 1.281063
C  -2.982007 0.780225 1.280779
C  -0.902723 -0.689189 -0.045698
C  -0.902729 0.689229 -0.045943
C  -3.083638 -0.679975 -1.201865
C  -3.083621 0.679563 -1.202131
C  0.34442 -1.483955 -0.007853
C  0.344405 1.484022 -0.008376
C  1.633232 -0.713708 -0.003896
C  1.633225 0.713789 -0.004151
C  2.861895 -1.414812 0.003494
C  2.861882 1.414906 0.002988
C  4.083525 -0.708237 0.009788
C  4.083518 0.708345 0.009537
H  -2.247507 -2.403561 -0.082793
H  -2.247534 2.403567 -0.083671
H  -2.435892 -1.181152 2.153025
H  -4.010547 -1.178041 1.313518
H  -4.010558 1.178533 1.313093
H  -2.435901 1.181963 2.152593
H  -3.615826 -1.307982 -1.922132
H  -3.615801 1.3073 -1.922638
H  2.833648 -2.509154 0.004618
H  2.833625 2.509248 0.003724
H  5.0322 -1.255386 0.014836
H  5.032188 1.255504 0.014391
