program: Gaussian 09
title: 000141725
version: EM64L-G09RevD.01
frameworkgroup: C1[X(C9H16)]
method: RPBEPBE
basis: SDD
operation: Freq
keyword: #p
keyword: freq=noraman
keyword: PBEPBE/SDD
title: #p freq=noraman PBEPBE/SDD
converged: YES YES NO NO
title: Mulliken charges:
elementType: C C C C C C C C C H H H H H H H H H H H H H H H H
charge: -0.168086 0.011906 -0.519506 -0.519624 -0.449296 -0.449309 -0.402227 -0.402186 -0.384732 0.242088 0.182122 0.231804 0.220692 0.220702 0.231823 0.187625 0.209246 0.209240 0.187671 0.196253 0.190691 0.190670 0.196255 0.198290 0.187889
chargesum: 0.00000
title: Mulliken charges with hydrogens summed into heavy atoms:
elementType: C C C C C C C C C
charge: 0.074003 0.194028 -0.067010 -0.067100 -0.052425 -0.052399 -0.015283 -0.015261 0.001447
polarizability: 1.06652672e+02 7.54011061e-04 9.00572720e+01 -8.79971243e-01 4.01134255e-03 7.76991234e+01
1716.lowfreq: -30.5336 -11.1289 -0.0002 0.0004 0.0005 24.9249 80.4718 103.5780 154.4628
frequency: 80.1374 103.5751 154.3963 218.0288 247.7062 324.1577 381.9471 408.1583 436.4290 449.4120 507.8956 756.3464 781.5884 789.1334 811.3032 824.2385 858.8993 873.5462 874.0832 898.6484 935.5744 952.5606 987.3127 1032.4350 1046.5024 1052.7423 1056.4510 1076.5430 1101.8868 1104.7399 1111.0940 1162.5190 1173.5693 1187.6528 1204.7848 1238.0117 1255.2325 1256.6395 1274.1776 1298.4790 1326.1648 1331.5464 1334.9673 1340.0435 1347.6632 1380.9777 1438.9317 1456.5826 1460.0071 1460.3178 1466.6563 1467.2334 1474.8221 2930.3681 2954.2612 2960.1159 2961.7415 2962.1299 2963.6000 3019.1189 3023.0082 3025.4995 3026.7433 3038.4999 3081.3084 3084.4433 3095.7056 3181.2959 3200.2444
redmass: 2.6876 2.6846 2.4404 1.7566 2.3850 2.3561 2.0951 2.7525 2.9731 2.5124 1.4929 1.4294 1.4573 1.4098 1.3030 2.7242 1.9500 1.8823 2.7023 1.4590 2.4546 2.4771 1.5591 1.2453 1.7829 1.1101 1.2926 1.3447 1.1659 2.2599 2.5230 1.3940 2.4088 1.5096 1.5705 1.4138 1.2964 1.3080 1.2422 1.2685 1.4212 1.3913 1.4914 1.4690 1.4447 1.9180 1.0872 1.0872 1.0907 1.0885 1.3103 1.0812 1.1089 1.0813 1.0625 1.0622 1.0617 1.0612 1.0659 1.0957 1.0984 1.0953 1.1030 1.1037 1.0836 1.0510 1.0677 1.1165 1.1145
irintensity: 0.0339 0.0020 0.0751 0.0671 0.1667 0.2512 0.2803 0.2865 0.0468 0.1288 0.7529 0.2464 0.0091 1.3082 11.6824 3.3161 15.1950 1.5862 18.0223 2.7004 0.0908 3.9688 13.1699 31.4611 0.5280 0.0001 6.7482 0.1083 0.3146 1.7103 0.0199 0.5557 0.3517 0.7445 0.9822 0.4242 1.4325 2.8523 0.6502 0.3696 0.0520 0.0175 3.2242 0.5679 1.0386 0.4703 7.0792 2.8095 4.2791 10.3470 6.9656 21.2672 1.1836 10.3742 24.0867 73.1092 26.6727 24.1806 31.0700 108.8195 80.2248 5.6376 2.0979 136.2765 29.7912 28.3767 8.8021 0.2001 41.2140
temp: 298.150 k
press: 1.00000 atm
elementType: 6 6 6 6 6 6 6 6 6 1 1 1 1 1 1 1 1 1 1 1 1 1 1 1 1
symmnumber: 1
zpe: 598626.5 jmol-1
zpe.correction: 0.228005 hartree
zpe.thermalcorrener: 0.237003 hartree
zpe.thermalcorrenthalpy: 0.237947 hartree
zpe.thermalcorrgfe: 0.194313 hartree
zpe.sumelectzpe: -351.796566 hartree
zpe.sumelectthermal: -351.787568 hartree
zpe.sumelectthermalent: -351.786624 hartree
zpe.sumelectthermalfe: -351.830258 hartree
dipole: -0.1695 -0.0002 0.0595
dipole: 0.1797
quadrupole: -58.8020 -58.2448 -55.9293
quadrupole: -0.0015 0.9952 -0.0015
quadrupole: -1.1433 -0.5861 1.7294 -0.0015 0.9952 -0.0015
hfenergy: -352.024571 hartree
pointgroup: C01[X(C9H16)]
dipole: -0.0666483 0.0000528 -0.0235299 debye
dipolederiv: -0.0643955 0.0000761 -0.0791354 0.0008775 0.1324146 0.0002472 -0.1689802 0.0000015 0.0791619 0.14397 -0.0000152 0.0442597 0.0001867 0.0719746 -0.0000232 0.0027151 0.000018 0.1095044 -0.0513939 0.0950707 -0.0742266 0.1229534 -0.1492678 0.0518415 -0.0394024 0.052372 0.0701963 -0.0506243 -0.093944 -0.0750042 -0.1222735 -0.1487951 -0.0543898 -0.0405555 -0.0547938 0.0690862 -0.0389135 0.0201177 0.0118055 -0.0042517 0.0445376 0.0125431 0.0399049 -0.0157148 0.1590174 -0.0389763 -0.0204441 0.0116421 0.0033996 0.0442974 -0.0133823 0.03997 0.0149357 0.1589882 0.0429134 -0.0205421 0.0144663 0.0136611 0.0606205 -0.0139122 -0.0176623 0.0062736 0.1520788 0.042818 0.0203798 0.0145732 -0.0136163 0.0606912 0.0132474 -0.0177103 -0.0070341 0.152146 0.0722882 0.0001349 -0.0148027 -0.0000174 0.0330535 -0.000494 0.0235462 -0.0003963 0.152421 -0.0120706 0.000064 -0.0433129 -0.0002028 0.0959961 0.0012522 0.0011628 0.0013432 -0.1414542 0.0266801 0.0001207 -0.0265409 0.000085 0.0174193 0.0007597 -0.0299637 0.0007352 -0.1906336 -0.0392472 0.1049489 0.0709852 0.1030628 0.0041436 -0.0216368 0.0920661 -0.0466078 0.0260856 0.0935903 -0.0172355 0.0773451 0.0212739 0.0011082 0.0774869 0.0364316 0.1026384 -0.0524947 0.093539 0.0166374 0.0777531 -0.0214452 0.0030972 -0.0766347 0.0363616 -0.1019528 -0.0544664 -0.0386627 -0.1059117 0.0697981 -0.1041879 0.0028421 0.0215661 0.090835 0.0466015 0.0268078 0.0395988 0.0231316 0.0015159 0.0173415 0.0655929 -0.0313155 0.0097287 0.038525 -0.1914033 -0.0248024 -0.1296568 -0.0251169 -0.111289 -0.1311599 -0.0367353 -0.0326665 -0.0662415 0.0521322 -0.025869 0.1303246 -0.0242729 0.112065 -0.1308736 0.0351929 -0.0320802 0.0646422 0.0529248 0.0398399 -0.0232838 0.001162 -0.0174855 0.0654703 0.0333156 0.0097058 -0.0364607 -0.1914139 -0.0625575 0.1202017 -0.0232073 0.1280108 -0.161647 0.0409708 -0.0378699 0.0718075 0.0606962 0.0324585 -0.0294494 -0.0299005 -0.0324006 0.0628519 0.0161861 0.0174651 -0.0459338 -0.2016359 0.0321757 0.0295376 -0.0296389 0.0321169 0.0628734 -0.014282 0.0174796 0.0480443 -0.2013902 -0.0614334 -0.1195142 -0.023943 -0.12726 -0.1618654 -0.0427856 -0.0385181 -0.0736995 0.0598131 -0.2326523 -0.0009055 0.0767965 -0.0010615 0.0374909 0.0001516 0.1175116 0.0002439 0.0429813 0.0817268 0.0001569 -0.0030006 0.0004575 0.0171333 0.0008302 -0.0794749 0.000653 -0.1991489 unknown
polarizability: 106.6495912|0.026123|90.0570806|0.9285276|0.0553277|77.7023952 unknown
InChI: InChI=1S/C9H16/c1-2-4-8(5-3-1)9-6-7-9/h8-9H,1-7H2
charge 0 multiplicity 1
25 atoms
C  1.686829 0.005108 -0.4580
C  0.277466 -0.000388 0.13113
C  2.822851 -0.767458 0.228248
C  2.820799 0.773196 0.236793
C  -0.510419 1.272237 -0.277358
C  -0.504588 -1.273239 -0.287293
C  -1.949206 1.27009 0.292985
C  -1.943313 -1.282167 0.283099
C  -2.717826 -0.006212 -0.126295
H  1.707027 0.011283 -1.556882
H  0.367419 -0.004446 1.241322
H  3.563996 -1.278968 -0.39317
H  2.592755 -1.281829 1.167547
H  2.589263 1.276556 1.18169
H  3.560498 1.293419 -0.379076
H  -0.558178 1.320668 -1.386272
H  0.039225 2.173906 0.056943
H  0.049099 -2.175065 0.039866
H  -0.552164 -1.313233 -1.396541
H  -2.494341 2.174288 -0.041885
H  -1.902222 1.316707 1.401306
H  -1.895985 -1.337117 1.391025
H  -2.484348 -2.186208 -0.058744
H  -3.729886 -0.010264 0.323678
H  -2.855454 -0.002264 -1.227917
