program: Gaussian 09
title: 000141687
version: EM64L-G09RevD.01
frameworkgroup: C1[X(C16H16O3)]
method: RPBEPBE
basis: SDD
operation: Freq
keyword: #pfreq=noraman
keyword: PBEPBE/SDD
title: #p freq=noraman PBEPBE/SDD
converged: YES YES NO NO
title: Mulliken charges:
elementType: O O O C C C C C C C C C C C C C C C C H H H H H H H H H H H H H H H H
charge: -0.234310 -0.166839 -0.393092 0.192560 0.205807 0.029628 0.168210 -0.477077 0.455336 -0.477466 0.453880 0.123545 -0.365765 -0.415743 -0.384814 -0.394457 -0.817808 -0.817096 -0.537660 0.259650 0.262151 0.239871 0.229552 0.232794 0.216830 0.229362 0.222569 0.231978 0.229957 0.222436 0.233422 0.354152 0.214462 0.251152 0.222823
chargesum: 0.00000
title: Mulliken charges with hydrogens summed into heavy atoms:
elementType: O O O C C C C C C C C C C C C C C C C
charge: -0.234310 -0.166839 -0.038940 0.192560 0.205807 0.029628 0.168210 -0.217426 0.455336 -0.215315 0.453880 0.123545 -0.125894 -0.186191 -0.152020 -0.177627 -0.133900 -0.131280 0.150776
polarizability: 2.34689674e+02 2.49740406e+00 1.87444773e+02 -1.27970890e+01 7.19156749e+00 1.45730595e+02
1716.lowfreq: -2.8896 -0.0009 -0.0005 0.0003 1.4195 6.6957 18.9262 21.6733 28.6916
frequency: 18.2991 21.6039 28.6409 33.6719 56.7396 84.2623 101.3958 123.3775 132.0886 153.0782 188.7308 196.4637 243.5081 250.1483 301.4245 315.7740 328.8825 339.6649 342.3530 362.9941 401.1099 422.1013 442.4568 451.0885 461.3516 500.3139 531.5076 543.1981 590.9070 652.0039 680.5181 683.2922 715.4684 745.3308 767.0282 788.8574 803.0613 805.9585 812.4567 894.6596 904.3746 909.9498 941.8561 946.2585 960.1550 984.1662 1001.0416 1004.3593 1048.1901 1048.8860 1079.4955 1111.4617 1123.1081 1144.8663 1163.9201 1169.0713 1195.5048 1230.0642 1237.6736 1250.3207 1267.2091 1285.2548 1298.2877 1372.0149 1383.5749 1394.7478 1395.5136 1400.1685 1400.4516 1436.0755 1467.9325 1470.4533 1472.5822 1473.0128 1474.9797 1476.0665 1488.3648 1496.6121 1566.9709 1582.7176 1599.0101 1615.2891 1617.6566 2957.8664 2973.0620 2973.8604 3046.9193 3053.1798 3054.4825 3082.2018 3083.3303 3107.4224 3123.1052 3126.8430 3128.1519 3130.9138 3138.2123 3164.1631 3565.2506
redmass: 1.0877 5.2329 3.3332 1.0372 4.2060 3.2899 4.6947 4.2800 4.7242 4.9778 4.6694 3.7364 1.1318 3.9649 3.7240 4.5500 3.1316 1.6103 2.1136 4.0353 5.1359 4.4777 3.9147 4.0008 5.1835 4.1322 3.1638 3.7258 4.1948 6.0720 4.8790 5.9285 4.5205 4.3115 4.4974 4.6396 1.6960 3.1868 1.6498 4.1598 1.4443 1.3776 1.4000 1.3650 2.8057 6.8910 1.5165 1.6013 1.5328 1.5357 2.5231 1.2576 1.8338 1.3960 1.2617 1.3060 1.8735 2.2154 4.4811 2.9606 3.1093 1.7706 1.4280 6.1831 5.1577 3.2299 2.9413 1.3229 1.3195 1.2088 1.1462 1.0718 1.0656 1.0934 1.1084 1.0894 2.1549 2.5422 8.2109 6.8954 6.8944 6.2760 6.6313 1.0334 1.0386 1.0388 1.1035 1.0954 1.0951 1.0995 1.0996 1.0878 1.0897 1.0915 1.0985 1.0913 1.0960 1.0935 1.0660
irintensity: 0.7554 4.2183 0.0595 0.5659 3.5674 3.9260 1.5555 0.7668 1.6941 0.3816 0.9807 4.8674 0.3837 1.7901 4.4751 9.3217 2.3276 65.8520 43.7311 12.3636 0.7425 5.8732 6.6802 13.9245 4.8381 1.6841 21.3596 9.0210 4.4074 26.4255 2.7782 0.3839 3.1818 5.2479 16.1757 4.5090 36.1553 60.7529 54.9872 3.9179 9.9908 0.8127 7.5544 2.4959 55.7967 30.6806 1.5380 2.3520 7.9923 12.6935 96.8140 0.2949 97.5576 12.6004 25.4507 12.4187 133.8136 83.8254 81.6196 35.2974 143.5971 80.0536 31.1184 6.2431 22.2486 4.3658 10.6337 13.8924 17.1444 8.4573 72.4516 21.4510 26.1409 14.5281 11.3928 13.7021 37.0582 51.1365 182.9453 65.7538 27.9839 11.9107 44.2645 79.5520 37.0538 43.6884 44.8327 24.2764 20.9721 17.9828 17.8559 17.1389 21.6630 17.0031 9.0015 12.8512 19.0879 17.6864 31.9834
temp: 298.150 k
press: 1.00000 atm
elementType: 8 8 8 6 6 6 6 6 6 6 6 6 6 6 6 6 6 6 6 1 1 1 1 1 1 1 1 1 1 1 1 1 1 1 1
symmnumber: 1
zpe: 723228.8 jmol-1
zpe.correction: 0.275463 hartree
zpe.thermalcorrener: 0.294541 hartree
zpe.thermalcorrenthalpy: 0.295485 hartree
zpe.thermalcorrgfe: 0.225128 hartree
zpe.sumelectzpe: -843.585493 hartree
zpe.sumelectthermal: -843.566416 hartree
zpe.sumelectthermalent: -843.565471 hartree
zpe.sumelectthermalfe: -843.635828 hartree
dipole: 0.4013 3.4603 1.4933
dipole: 3.7900
quadrupole: -78.2331 -112.8231 -106.3404
quadrupole: 1.3461 -10.6330 -3.3941
quadrupole: 20.8991 -13.6909 -7.2082 1.3461 -10.6330 -3.3941
hfenergy: -843.8609566 hartree
pointgroup: C01 [X(C16H16O3)]
dipole: -0.0817516 -0.2100889 1.4739792 debye
polarizability: 227.2438627|25.6113922|151.3242273|6.1292682|8.2607809|189.2969515 unknown
InChI: InChI=1S/C16H16O3/c1-10-4-6-14(17)12(8-10)16(18)13-9-11(2)5-7-15(13)19-3/h4-9,17H,1-3H3
charge 0 multiplicity 1
35 atoms
O  -1.729888 -1.869491 -2.013548
O  0.334378 0.071054 -2.454732
O  2.458862 1.851081 -1.750253
C  -1.083686 -0.116224 -0.498662
C  1.470956 0.158233 -0.316121
C  0.249215 0.038244 -1.195656
C  -2.096721 -1.00349 -0.981812
C  -1.387589 0.720897 0.60265
C  -2.663565 0.740668 1.218518
C  1.577337 -0.660009 0.839128
C  2.739663 -0.703136 1.645216
C  2.578826 0.991289 -0.65241
C  -3.377823 -0.999371 -0.378249
C  -3.651831 -0.129171 0.700144
C  3.828514 0.123663 1.271182
C  3.748405 0.967779 0.144429
C  -2.949741 1.652214 2.399757
C  2.809755 -1.589088 2.877606
C  -2.75708 -2.754682 -2.565566
H  -0.603825 1.39397 0.971035
H  0.722618 -1.296543 1.096907
H  -4.165632 -1.667378 -0.738409
H  -4.653831 -0.1345 1.146641
H  4.748141 0.112556 1.868434
H  4.599425 1.610466 -0.118448
H  -2.470582 2.639812 2.274354
H  -4.033856 1.816605 2.529099
H  -2.566225 1.221095 3.345181
H  2.269455 -2.539962 2.723795
H  3.854032 -1.832402 3.141388
H  2.354703 -1.09299 3.757113
H  3.290481 2.374647 -1.87241
H  -3.131995 -3.467488 -1.804446
H  -2.250144 -3.304497 -3.371603
H  -3.603351 -2.17595 -2.983351
