program: Gaussian 09
title: 000141635
version: EM64L-G09RevD.01
frameworkgroup: C1[X(C8H12)]
method: RPBEPBE
basis: SDD
operation: Freq
keyword: #p
keyword: freq=noraman
keyword: PBEPBE/SDD
title: #p freq=noraman PBEPBE/SDD
converged: NO YES NO NO
title: Mulliken charges:
elementType: C C C C C C C C H H H H H H H H H H H H
charge: -0.313149 -0.313126 -0.453203 -0.453208 -0.453202 -0.453207 0.557966 -0.798314 0.250432 0.250432 0.202297 0.229976 0.229976 0.202297 0.229966 0.202302 0.202305 0.229963 0.224750 0.224748
chargesum: 0.00000
title: Mulliken charges with hydrogens summed into heavy atoms:
elementType: C C C C C C C C
charge: -0.062717 -0.062694 -0.020930 -0.020934 -0.020934 -0.020939 0.557966 -0.348817
polarizability: 9.41374386e+01 -2.14528607e-03 7.04098632e+01 -1.47605214e-05 1.46194111e-04 7.33919927e+01
1716.lowfreq: 0.0002 0.0003 0.0006 23.0335 25.6674 33.8735 148.8912 149.8990 278.9306
frequency: 148.2661 149.8104 278.9260 375.8273 377.0911 518.6653 625.8698 683.9761 728.3205 732.0601 789.8929 806.9992 831.3775 867.4576 884.5784 898.4990 935.5230 940.9214 950.7301 998.5078 1003.3134 1014.6048 1064.9330 1106.5217 1119.4127 1169.9950 1174.4608 1201.4186 1224.9010 1236.8502 1240.3004 1251.6127 1269.3698 1294.9965 1299.7773 1304.2731 1432.8723 1458.0064 1472.0983 1472.7792 1490.8737 1711.4232 2993.7748 2994.9657 3009.1238 3009.6628 3047.7657 3050.8581 3071.0204 3073.8533 3075.7530 3083.3842 3084.8295 3185.4812
redmass: 1.7701 3.1192 1.8625 1.8849 2.4212 3.2001 4.3792 3.3579 1.1173 3.7875 1.6207 1.3164 2.3061 2.1186 2.9036 3.6664 1.3803 1.7122 1.6566 2.4541 1.5690 2.1157 1.6358 1.1022 1.0732 1.8103 1.5502 1.1714 1.7138 1.4735 1.7764 1.3897 1.3027 1.4862 1.3802 1.6809 1.1557 1.0786 1.0906 1.0831 1.0942 6.9753 1.0580 1.0580 1.0615 1.0615 1.1061 1.1044 1.1061 1.0892 1.1011 1.0871 1.0706 1.1140
irintensity: 0.0000 0.7277 0.0223 0.1203 0.2448 0.0000 0.0037 7.6462 0.0000 0.2236 2.7187 9.0440 4.2262 2.6745 1.4525 1.4574 81.7877 0.0000 0.5692 1.6407 0.0000 0.0099 5.1089 0.3693 5.2171 3.0888 2.9203 0.0000 1.3487 2.7228 0.0000 1.2293 0.0000 0.6008 1.9045 1.5491 3.1947 0.0000 10.8581 7.2931 3.3572 28.4247 69.3430 0.0001 87.4967 53.1660 0.0000 4.7228 41.4895 70.2622 55.5833 12.0800 37.4650 19.5757
temp: 298.150 k
press: 1.00000 atm
elementType: 6 6 6 6 6 6 6 6 1 1 1 1 1 1 1 1 1 1 1 1
symmnumber: 1
zpe: 467850.9 jmol-1
zpe.correction: 0.178195 hartree
zpe.thermalcorrener: 0.185020 hartree
zpe.thermalcorrenthalpy: 0.185964 hartree
zpe.thermalcorrgfe: 0.147546 hartree
zpe.sumelectzpe: -311.397983 hartree
zpe.sumelectthermal: -311.391159 hartree
zpe.sumelectthermalent: -311.390214 hartree
zpe.sumelectthermalfe: -311.428633 hartree
dipole: -0.6032 0.0002 0.0000
dipole: 0.6032
quadrupole: -49.4243 -50.7498 -48.1047
quadrupole: 0.0001 0.0000 0.0001
quadrupole: 0.0020 -1.3235 1.3216 0.0001 0.0000 0.0001
hfenergy: -311.5761785 hartree
pointgroup: C01 [X(C8H12)]
dipole: -0.2373121 0.0001395 0.0000361 debye
dipolederiv: 0.0052156 0.0000518 -0.0689222 0.0000946 0.0770516 0.0000514 -0.0096879 0.0000253 0.0627109 0.0052728 0.0000272 0.0689457 0.0000954 0.0770797 -0.0000461 0.0097079 -0.0000217 0.0626777 0.0881928 0.0548196 0.0151843 0.0187809 0.0636715 -0.0632372 0.0096739 -0.0312044 0.0116343 0.088145 -0.0548605 0.0152368 -0.0188302 0.0637167 0.0632383 0.0096998 0.0312196 0.0116842 0.0881952 0.0548301 -0.0151901 0.0187968 0.0636069 0.0632517 -0.0097058 0.0312152 0.0116841 0.0881528 -0.0548548 -0.0152819 -0.0188313 0.0637269 -0.063214 -0.0097458 -0.031186 0.0116561 0.3610067 -0.0002378 -0.0000209 -0.0003689 -0.1780979 -0.0000671 -0.0000051 -0.0000658 0.171388 -0.2656489 -0.0000287 0.0000402 -0.0000546 -0.4407506 -0.0000943 0.0000406 -0.000095 0.0715112 0.0265318 -0.0000143 0.1048325 -0.0000079 0.0406021 -0.000016 0.0651345 -0.0000041 -0.1507452 0.026486 0.000025 -0.1048847 0.0000164 0.0405973 0.0000884 -0.065187 0.0000779 -0.1506987 -0.1746147 0.0349606 -0.11926 -0.004207 0.0656139 -0.0139065 -0.0719834 0.0041004 0.0020427 0.0461454 -0.0984377 0.0561669 -0.0522967 -0.1321654 0.0893625 0.0129476 0.0694017 0.0065712 0.0463026 0.098239 0.0561133 0.052119 -0.1322668 -0.089475 0.0129039 -0.0694711 0.0065061 -0.1746394 -0.034681 -0.1192607 0.0044924 0.0656385 0.0140546 -0.0719945 -0.0040042 0.0020415 0.0461005 -0.0984658 -0.0562241 -0.0523442 -0.132087 -0.0893839 -0.0129834 -0.0694149 0.0065313 -0.1745489 0.0349447 0.1193323 -0.004197 0.0656119 0.0139142 0.0720451 -0.0040981 0.0019818 -0.1745703 -0.0347601 0.1193034 0.0044208 0.0656442 -0.0140135 0.0720561 0.0040482 0.001977 0.0462554 0.0983127 -0.0560964 0.0521771 -0.132312 0.0893917 -0.0128991 0.0693758 0.0065922 0.0009885 0.0000771 -0.0651842 0.0000927 0.1975588 0.0000707 -0.1123422 0.000095 -0.0738479 0.0010311 0.0000528 0.0651697 0.0000517 0.1975598 0.0000302 0.1123249 0.0000061 -0.0738984 unknown
polarizability: 94.1374362|-0.0073289|70.4098653|-0.0026247|-0.000474|73.391993 unknown
InChI: InChI=1S/C8H12/c1-6-7-2-3-8(6)5-4-7/h7-8H,1-5H2
charge 0 multiplicity 1
20 atoms
C  0.007687 0.000196 -1.149191
C  0.007992 -0.000245 1.149146
C  -0.83894 1.265055 -0.790021
C  -0.840206 -1.263939 -0.790506
C  -0.838682 1.264772 0.790701
C  -0.83996 -1.26425 0.790212
C  1.018649 -0.000495 -0.000175
C  2.369518 -0.000885 -0.000349
H  0.418751 0.000177 -2.170478
H  0.419343 -0.000653 2.170318
H  -1.85836 1.204959 -1.212717
H  -0.363363 2.180934 -1.184915
H  -0.365564 -2.180153 -1.185752
H  -1.85956 -1.202657 -1.213192
H  -0.362857 2.180452 1.185765
H  -1.857963 1.204637 1.213724
H  -1.859181 -1.203271 1.213262
H  -0.365062 -2.180567 1.184918
H  2.943101 -0.001257 0.934183
H  2.942856 -0.000912 -0.935033
