program: Gaussian 09
title: 000141616
version: EM64L-G09RevD.01
frameworkgroup: C1[X(C9H13NO)]
method: RPBEPBE
basis: SDD
operation: Freq
keyword: #p
keyword: freq=noraman
keyword: PBEPBE/SDD
title: #p freq=noraman PBEPBE/SDD
converged: YES YES NO NO
title: Mulliken charges:
elementType: O N C C C C C C C C C H H H H H H H H H H H H H
charge: -0.415987 -0.197661 0.277988 -0.608742 -0.585595 -0.585487 0.099885 -0.346434 -0.371352 -0.309655 -0.197096 0.261846 0.238898 0.261855 0.242111 0.211314 0.338946 0.338991 0.211307 0.242030 0.224317 0.236713 0.217808 0.213999
chargesum: 0.00000
title: Mulliken charges with hydrogens summed into heavy atoms:
elementType: O N C C C C C C C C C
charge: -0.415987 -0.197661 0.277988 0.153858 0.206775 0.206841 0.099885 -0.122117 -0.134638 -0.091847 0.016903
polarizability: 1.38313284e+02 -6.25073477e+00 1.14203979e+02 4.66393455e-03 5.39840315e-03 6.68775332e+01
1716.lowfreq: -13.8184 -13.6776 0.0008 0.0008 0.0009 4.3018 94.9672 120.0783 231.2179
frequency: 94.9225 120.0757 231.2175 256.3713 258.8655 301.5985 319.5709 336.0404 343.0797 348.8162 407.0610 415.1515 475.0039 494.2654 539.8613 562.2671 563.5564 664.4568 721.0522 737.4889 793.2728 840.0644 843.1891 895.2975 910.3708 959.4937 968.0592 1021.5423 1042.9544 1044.4162 1099.4741 1111.1126 1128.6947 1166.5059 1219.4683 1226.1499 1244.9953 1255.0158 1319.8408 1343.0101 1375.7151 1399.3793 1423.5981 1433.9151 1453.7732 1460.4168 1472.9975 1483.3366 1484.2189 1499.7674 1523.2188 1532.9797 1609.2216 2961.6941 2970.1353 3021.0012 3083.0915 3088.6666 3115.2016 3125.8898 3127.8553 3131.4909 3136.3155 3143.9148 3149.3347 3163.7005
redmass: 3.3388 3.5010 4.0881 1.0739 3.3671 1.6091 1.8029 1.3168 3.3530 1.8847 2.6084 2.9749 3.0550 3.7492 5.4646 3.6189 4.7350 4.9751 1.4076 2.5575 4.0484 1.6017 4.9860 1.8094 1.9341 2.7770 1.3047 3.0826 2.6139 1.2011 1.3923 1.2919 1.4535 1.1112 1.8275 1.6587 1.8859 1.8749 3.0117 2.5667 1.1089 1.2805 1.1927 1.0578 1.3559 2.4168 1.0467 1.9212 1.0899 1.0520 1.0729 5.6810 6.0688 1.0373 1.0368 1.0323 1.1000 1.1008 1.0856 1.0948 1.1036 1.0983 1.1029 1.1042 1.0933 1.0994
irintensity: 3.9584 3.6853 3.3697 0.7697 11.5426 1.8663 7.0967 0.7492 17.6261 4.0755 1.9253 4.1255 18.1831 4.8853 1.5291 0.0809 2.8812 3.5727 56.0337 28.8911 23.6571 17.2462 2.8501 0.9958 13.0609 20.1415 0.5906 29.3418 14.9835 2.7273 1.2197 5.5438 22.8220 1.8447 2.2221 9.0903 0.0582 17.5934 107.4295 34.7620 43.8289 149.6652 39.4401 0.0008 54.8089 1.8015 9.3310 35.5598 10.1126 15.9839 42.5671 12.6341 80.4112 44.1129 153.6878 15.5417 1.2639 2.3204 11.7609 17.3237 3.2505 12.5359 39.7387 10.0806 26.5922 23.6440
temp: 298.150 k
press: 1.00000 atm
elementType: 8 7 6 6 6 6 6 6 6 6 6 1 1 1 1 1 1 1 1 1 1 1 1 1
symmnumber: 1
zpe: 532305.2 jmol-1
zpe.correction: 0.202744 hartree
zpe.thermalcorrener: 0.213110 hartree
zpe.thermalcorrenthalpy: 0.214054 hartree
zpe.thermalcorrgfe: 0.168098 hartree
zpe.sumelectzpe: -479.834354 hartree
zpe.sumelectthermal: -479.823989 hartree
zpe.sumelectthermalent: -479.823045 hartree
zpe.sumelectthermalfe: -479.869000 hartree
dipole: -5.7820 -5.0002 0.0014
dipole: 7.6442
quadrupole: -54.7623 -73.2257 -66.9981
quadrupole: 2.2744 0.0000 -0.0024
quadrupole: 10.2330 -8.2303 -2.0027 2.2744 0.0000 -0.0024
hfenergy: -480.0370986 hartree
pointgroup: C01 [X(C9H13N1O1)]
dipole: 2.2203425 2.0279841 -0.045464 debye
dipolederiv: -0.9862535 0.4211433 0.0009669 0.4870317 -1.1364978 0.0018633 -0.0000806 0.0029705 -0.4802153 -0.2293362 0.0351672 -0.0002601 0.0500145 -0.2632502 -0.0000551 -0.000295 0.0000909 -0.2117951 0.3436602 -0.1513502 -0.0042243 0.5298648 -0.32988 -0.0045211 -0.0116596 0.0029031 -0.2169632 0.1154057 0.0357211 -0.0007308 0.0981935 0.2405487 -0.0029104 -0.0014826 -0.0023415 0.0782071 -0.0019582 -0.094188 -0.0052739 -0.1993313 0.0032103 0.1432881 -0.0254582 0.0651011 0.1959841 -0.0008464 -0.0956406 0.011727 -0.2011325 -0.0009588 -0.1343549 0.0342541 -0.0583785 0.1995748 0.51341 -0.5465736 0.0012691 -0.7438381 0.9659301 -0.0016181 0.0036198 -0.0039913 0.0790626 0.3526695 0.0414079 -0.0056553 -0.386358 0.0003912 0.0027083 -0.0010521 -0.0018041 -0.1311154 -0.265408 0.4701654 -0.0049802 0.015068 -0.1112169 -0.0016347 0.0001731 -0.006604 -0.2400934 -0.4257907 -0.161905 0.0032887 -0.0759776 -0.2017819 0.0000656 0.0021866 0.0011419 -0.2771737 0.1731155 -0.021561 -0.0029676 0.150615 0.3578917 -0.0069982 -0.0047698 -0.0051866 -0.1208263 0.1128108 0.053572 0.0679916 0.0037703 0.0412265 -0.0418077 0.0478887 -0.0716868 -0.021567 -0.125166 -0.0223157 0.00252 0.0825252 0.0841364 -0.0004736 0.0012737 0.0005297 0.1120176 0.110325 0.0531204 -0.0717342 0.0033968 0.0438304 0.040244 -0.0504172 0.0693081 -0.021945 0.0906782 0.0644175 -0.0402757 0.023836 0.0423164 0.1082035 -0.0261274 0.0379351 -0.0226935 -0.1915928 0.017685 0.0297441 -0.0146209 0.1224858 -0.0176197 -0.0245962 -0.0200947 0.0554347 0.3044108 -0.0484268 -0.0923637 0.1328032 0.0638976 -0.0933316 -0.1396783 0.0280892 0.1753923 0.3085203 -0.046973 0.0904839 0.1373817 0.0653011 0.0928922 0.1336304 -0.0246923 0.1690087 -0.1915882 0.017744 -0.0247407 -0.013194 0.1232482 0.0164479 0.0302457 0.018057 0.054582 0.0920187 0.0644274 0.0361318 0.0218021 0.0386998 -0.1102792 0.0229969 -0.0408058 -0.020548 0.0591865 -0.1107641 0.0021633 -0.1106022 -0.0940991 0.0038406 0.0021729 0.0037063 0.1464568 0.0231658 -0.0541435 0.0021149 -0.0913497 -0.0614706 0.0034851 0.002521 0.0030382 0.161159 0.0021856 0.0859613 0.0011002 0.1013744 -0.0875576 0.0019153 0.0010298 0.0019902 0.1882306 -0.1836225 -0.0066909 0.003705 -0.0012729 0.0935988 0.0006506 0.0036242 0.0007243 0.1498257 unknown
polarizability: 138.6270371|-5.5939398|113.8774522|-0.7091372|-0.4628443|66.8903063 unknown
InChI: InChI=1S/C9H13NO/c1-10(2,3)8-6-4-5-7-9(8)11/h4-7H,1-3H3
charge 0 multiplicity 1
24 atoms
O  0.150189 -2.181945 0.025328
N  1.595396 0.278688 -0.017308
C  0.065952 0.26086 -0.001068
C  2.179079 1.676259 -0.038847
C  2.087448 -0.474313 -1.263797
C  2.113874 -0.445882 1.235419
C  -0.551819 -1.062524 0.020226
C  -0.673706 1.462886 -0.006482
C  -1.998843 -1.036945 0.036006
C  -2.083642 1.421289 0.009343
C  -2.733848 0.156443 0.030609
H  1.857527 2.223941 0.859356
H  3.276916 1.585888 -0.047742
H  1.840975 2.202913 -0.943437
H  1.726362 0.065616 -2.152292
H  3.189626 -0.513264 -1.244992
H  1.64013 -1.483094 -1.201517
H  1.664702 -1.455131 1.206355
H  3.215553 -0.48707 1.193178
H  1.773256 0.115428 2.118518
H  -0.183402 2.442394 -0.022431
H  -2.497999 -2.012394 0.052417
H  -2.660108 2.35154 0.005551
H  -3.83022 0.114315 0.043009
