program: Gaussian 09
title: 000011303
version: EM64L-G09RevD.01
frameworkgroup: C1[X(C19H30O2)]
method: RPBEPBE
basis: SDD
operation: Freq
keyword: #pfreq=noraman
keyword: PBEPBE/SDD
title: #p freq=noraman PBEPBE/SDD
converged: YES YES NO NO
title: Mulliken charges:
elementType: O O C C C C C C C C C C C C C C C C C C C H H H H H H H H H H H H H H H H H H H H H H H H H H H H H H
charge: -0.443535 -0.187780 -0.119919 0.374489 -0.078471 -0.176704 -0.064755 0.275722 -0.514522 -0.506156 -0.498054 -0.488890 -0.508175 -0.534143 -0.529582 -0.823752 0.064491 -0.441706 -0.514646 -0.059360 -0.790642 0.206354 0.218646 0.209696 0.185042 0.211781 0.217835 0.225387 0.201900 0.226261 0.211889 0.213293 0.194428 0.200296 0.205198 0.234191 0.220396 0.181788 0.234245 0.213237 0.223912 0.221157 0.218724 0.215717 0.241588 0.248772 0.179097 0.215912 0.246200 0.215156 0.327991
chargesum: 0.00000
title: Mulliken charges with hydrogens summed into heavy atoms:
elementType: O O C C C C C C C C C C C C C C C C C C C
charge: -0.115544 -0.187780 0.086435 0.374489 0.140175 0.032992 0.120287 0.275722 -0.084906 -0.078869 -0.059904 -0.081170 -0.102681 -0.079555 -0.113549 -0.165446 0.064491 -0.007266 -0.024286 0.119737 -0.113374
polarizability: 2.22261784e+02 1.30248779e-01 1.85213050e+02 4.70267288e+00 -5.15807184e+00 1.78746235e+02
1716.lowfreq: -8.5307 -0.5936 -0.0008 -0.0007 -0.0003 17.3073 42.3364 50.4714 73.1093
frequency: 41.6665 50.3314 73.1005 110.4883 128.2933 152.2147 162.8274 169.5065 197.6473 214.4495 231.2398 240.3687 259.9433 265.2483 277.6441 295.8724 307.2429 311.2141 315.9204 343.3783 361.3186 362.7567 402.3305 428.7869 445.1411 452.5133 465.5166 467.9368 499.3370 523.0175 529.6361 571.3531 582.5723 588.7920 611.8844 648.7336 693.2446 743.5440 785.4473 794.1128 814.3416 818.3391 841.2246 850.0718 869.1958 902.5536 907.5126 910.6742 934.5043 945.9747 952.5471 976.8277 990.6845 997.3299 1007.8930 1011.5598 1017.9386 1025.0164 1031.5331 1035.3334 1049.9578 1070.4072 1077.0467 1080.6093 1097.1085 1100.1530 1111.7213 1116.2586 1121.9917 1144.0499 1154.7874 1165.7736 1173.0896 1180.0656 1203.3361 1207.6214 1218.3011 1233.7602 1238.3537 1250.8552 1255.5231 1257.4141 1265.0191 1271.6178 1281.3416 1283.9614 1293.2887 1302.5272 1313.3146 1320.4850 1325.2212 1328.6012 1330.6742 1335.1407 1343.0951 1345.2800 1351.3196 1352.4466 1354.8271 1364.2557 1386.2370 1393.2105 1400.8726 1426.3817 1459.8518 1465.1572 1465.2731 1466.0642 1472.7468 1473.9639 1477.5858 1478.7043 1480.5159 1485.2382 1488.1092 1493.9549 1649.5800 2919.1387 2929.4726 2932.0553 2943.5726 2957.1163 2960.8331 2962.2245 2967.0756 2971.0101 2976.3526 2977.9874 2980.4934 2984.3308 2987.1151 2994.7162 3004.6379 3014.9708 3025.0705 3031.9383 3034.7613 3036.6329 3043.3301 3055.7856 3061.1607 3061.4277 3070.3322 3074.1478 3081.2223 3082.0752 3552.6948
redmass: 4.9965 3.8883 4.5570 3.6199 2.5144 2.9495 1.1606 2.1773 2.6532 2.8006 1.2890 2.5276 2.4105 2.9411 2.4084 2.0913 2.6679 2.7097 1.3843 2.7866 2.3277 2.5245 2.9349 3.0510 2.6682 2.4463 3.0463 2.7477 2.7000 2.2000 2.9755 3.2601 3.5111 3.0809 2.9475 4.0434 2.8798 2.1959 2.1097 1.9319 2.0940 2.0040 2.0457 2.3449 2.2503 1.8205 1.7024 2.0752 1.8519 1.8288 1.8720 1.9975 2.9150 1.7859 1.9022 2.2989 2.1265 1.8065 1.7967 1.9134 2.2606 2.0180 1.8891 1.7002 1.8440 1.4186 2.0188 2.4303 1.5283 1.9363 2.0025 1.9389 2.1622 2.0812 1.5276 1.7020 1.8982 2.0006 1.4382 1.4430 1.4036 1.4129 1.4021 1.3697 1.3874 1.2938 1.5001 1.2519 1.3803 1.4154 1.3783 1.4820 1.4180 1.3890 1.4079 1.4849 1.4872 1.4559 1.4761 1.4348 1.2008 1.2211 1.6403 1.0812 1.0783 1.0849 1.0839 1.0794 1.0566 1.0758 1.0880 1.0874 1.0660 1.0589 1.0845 1.0609 11.8212 1.0834 1.0806 1.0815 1.0819 1.0812 1.0648 1.0645 1.0602 1.0622 1.0421 1.0388 1.0589 1.0576 1.0650 1.0627 1.0636 1.1000 1.0952 1.0997 1.0961 1.0978 1.1013 1.1018 1.0976 1.0961 1.0989 1.1017 1.0992 1.0973 1.0659
irintensity: 0.2199 1.4034 4.9883 0.4420 0.5745 1.6761 0.1314 0.3694 1.3325 1.5537 0.7825 0.1250 0.4620 3.5074 8.6013 22.7637 4.1475 6.1910 118.7799 1.5581 1.2694 1.2399 0.1660 0.9696 4.8259 0.7437 4.2021 2.7015 1.1196 1.4043 2.4474 2.8585 9.4874 3.5927 4.8983 1.8262 0.9001 0.4948 1.8392 2.7235 2.6695 14.3186 9.5626 0.2223 2.5865 2.1014 6.2712 2.0442 1.5028 11.2332 2.7794 40.3824 45.9685 6.8020 2.1991 16.6257 4.8596 1.2352 8.1625 16.1339 6.8896 21.3070 10.0666 11.0656 4.7825 10.6861 11.1864 11.0384 3.1052 4.4957 20.9851 1.0214 6.6240 2.1646 3.2366 5.0261 3.3540 12.6882 28.6103 0.4475 1.6564 0.8450 2.4629 3.5065 3.3878 4.7255 1.5706 4.3316 0.3885 1.7439 1.0873 0.6520 4.5705 2.2713 0.3305 15.5912 15.8855 1.3950 0.7234 0.3761 27.1207 21.1254 3.4484 20.1041 2.8139 1.5071 6.9968 22.4327 4.5647 18.8997 6.4535 2.3754 8.5176 6.4407 10.9578 10.9380 186.8624 35.7755 13.9753 43.7153 15.0292 21.6810 50.9514 25.0138 37.5033 28.5475 28.5872 20.0316 70.8199 54.8455 13.9914 23.7394 21.9442 26.1658 19.2187 62.4420 53.1695 44.4935 65.0876 55.8543 53.0221 19.8569 25.2085 34.0999 18.7724 39.2513 2.3701
temp: 298.150 k
press: 1.00000 atm
elementType: 8 8 6 6 6 6 6 6 6 6 6 6 6 6 6 6 6 6 6 6 6 1 1 1 1 1 1 1 1 1 1 1 1 1 1 1 1 1 1 1 1 1 1 1 1 1 1 1 1 1 1
symmnumber: 1
zpe: 1189419.2 jmol-1
zpe.correction: 0.453026 hartree
zpe.thermalcorrener: 0.472929 hartree
zpe.thermalcorrenthalpy: 0.473873 hartree
zpe.thermalcorrgfe: 0.407023 hartree
zpe.sumelectzpe: -890.825996 hartree
zpe.sumelectthermal: -890.806094 hartree
zpe.sumelectthermalent: -890.805149 hartree
zpe.sumelectthermalfe: -890.871999 hartree
dipole: 3.3074 0.9710 3.1420
dipole: 4.6641
quadrupole: -149.1513 -128.8553 -130.4870
quadrupole: 1.2343 -1.8180 -6.8670
quadrupole: -12.9867 7.3093 5.6775 1.2343 -1.8180 -6.8670
hfenergy: -891.2790221 hartree
pointgroup: C01 [X(C19H30O2)]
dipole: 1.3126384 0.2987169 1.2469571 debye
polarizability: 222.2743602|-0.8923162|185.675656|4.4349689|-4.9511408|178.2710527 unknown
InChI: InChI=1S/C19H30O2/c1-18-9-7-13(20)11-12(18)3-4-14-15-5-6-17(21)19(15,2)10-8-16(14)18/h12-16,20H,3-11H2,1-2H3
charge 0 multiplicity 1
51 atoms
O  4.089523 -2.441576 -1.07332
O  -4.884397 -0.52216 -1.057383
C  0.322669 0.497143 -0.240701
C  1.754229 1.141251 -0.075949
C  -0.466435 0.45148 1.106433
C  -1.873453 -0.192764 0.962798
C  2.539626 0.398813 1.068661
C  -2.739929 0.400729 -0.192444
C  -0.549551 1.188337 -1.322049
C  0.344671 -0.233652 2.234031
C  -1.899888 0.465047 -1.516968
C  1.745854 0.392806 2.400714
C  2.596427 1.033798 -1.390122
C  -1.915295 -1.73609 0.721139
C  2.963991 -1.042041 0.663358
C  1.654319 2.655764 0.264366
C  -3.812905 -0.68726 -0.424913
C  3.012225 -0.400775 -1.782638
C  -3.358392 -2.002301 0.228202
C  3.787088 -1.062203 -0.638041
C  -3.384619 1.766149 0.119205
H  0.473345 -0.552864 -0.572101
H  -0.640453 1.505128 1.418752
H  -2.415045 -0.001114 1.916281
H  3.476934 0.976935 1.232983
H  -0.020522 1.206711 -2.293507
H  -0.730441 2.243998 -1.040424
H  0.446011 -1.314176 2.014018
H  -0.216798 -0.162344 3.187632
H  -2.508693 0.969996 -2.29065
H  -1.702049 -0.559848 -1.892548
H  1.643413 1.429914 2.776489
H  2.319761 -0.162644 3.169689
H  3.515734 1.640667 -1.2459
H  2.053038 1.508299 -2.228966
H  -1.676809 -2.305677 1.635217
H  -1.182409 -2.034071 -0.051434
H  3.555694 -1.483697 1.493253
H  2.084936 -1.696802 0.514007
H  2.652987 3.05499 0.525956
H  1.286685 3.233679 -0.603088
H  0.980678 2.863597 1.113204
H  2.131011 -1.027842 -2.017033
H  3.642141 -0.383165 -2.691259
H  -4.041749 -2.199077 1.079301
H  -3.469054 -2.851916 -0.467948
H  4.738896 -0.506295 -0.470464
H  -2.63647 2.578529 0.130072
H  -4.147787 2.003772 -0.64339
H  -3.885333 1.753508 1.105216
H  4.572687 -2.906686 -0.34344
