program: Gaussian 09
title: 000141557
version: EM64L-G09RevD.01
frameworkgroup: C1[X(C13H18)]
method: RPBEPBE
basis: SDD
operation: Freq
keyword: #p
keyword: freq=noraman
keyword: PBEPBE/SDD
title: #p freq=noraman PBEPBE/SDD
converged: YES YES NO NO
title: Mulliken charges:
elementType: C C C C C C C C C C C C C H H H H H H H H H H H H H H H H H H
charge: -0.027581 -0.443651 -0.539697 -0.527786 0.136897 0.123036 -0.750286 0.333666 0.338216 -0.457416 -0.457342 -0.831614 -0.833816 0.210428 0.202769 0.202599 0.216469 0.209171 0.218948 0.218069 0.208501 0.218540 0.212995 0.227346 0.227570 0.226292 0.229702 0.226298 0.230356 0.225583 0.225738
chargesum: 0.00000
title: Mulliken charges with hydrogens summed into heavy atoms:
elementType: C C C C C C C C C C C C C
charge: 0.182847 -0.038283 -0.114057 -0.090769 0.136897 0.123036 -0.110250 0.333666 0.338216 -0.230070 -0.229772 -0.149322 -0.152139
polarizability: 1.64809654e+02 2.31768496e+00 1.57394045e+02 6.61580980e-01 5.49547241e-01 8.54401455e+01
1716.lowfreq: -11.5400 -7.7863 -0.0004 0.0005 0.0006 5.8341 72.1867 102.0555 125.6256
frequency: 72.1712 102.0266 125.6239 163.9617 173.1702 197.8801 210.7006 225.3861 268.4713 285.3932 313.4429 319.7589 386.3441 412.8529 458.7131 462.0257 502.0509 508.5421 550.5105 591.1848 649.3078 721.7195 723.6543 807.7813 815.2205 851.1214 879.7062 925.3509 938.2126 943.7227 952.7246 975.7713 1020.1601 1023.8921 1039.4386 1040.6818 1054.8198 1095.4162 1102.0713 1138.1666 1161.3183 1173.6716 1197.0312 1234.5836 1254.0438 1260.4204 1263.2070 1292.7858 1307.3681 1335.5563 1340.3133 1358.7680 1373.8715 1387.6726 1397.5912 1400.0377 1413.9993 1451.0507 1458.9838 1466.6996 1467.5411 1472.2988 1473.5943 1475.2113 1476.6096 1477.8093 1482.6466 1590.2242 1610.8784 2930.2401 2944.2879 2954.9979 2964.2720 2964.8636 2965.4759 2970.1809 3002.8023 3010.5564 3031.3775 3037.5730 3038.0752 3058.7254 3065.5063 3078.8984 3079.4214 3110.8515 3136.3451
redmass: 2.9283 2.3277 2.4774 1.0338 1.1055 2.5716 1.4195 1.4428 2.4811 2.7814 2.6609 3.0109 3.5640 2.1288 4.5617 2.7859 2.9798 3.4899 2.8895 3.1752 4.0438 4.6602 3.0627 1.9909 1.2734 2.3693 1.6072 2.1581 1.6093 1.4030 1.5348 2.1140 2.0776 1.6414 1.5378 1.5224 1.8579 1.8168 2.5707 1.1854 1.8593 1.4889 2.3524 1.3775 1.4930 2.0016 2.3719 1.4093 1.3692 1.6299 1.5531 2.3891 2.1746 1.2370 1.2288 1.2951 2.7876 1.1008 1.1517 1.0957 1.1034 1.3465 1.6813 1.1114 1.0598 1.1234 1.1082 5.9023 7.2096 1.0673 1.0665 1.0777 1.0385 1.0383 1.0382 1.0621 1.0932 1.0911 1.1022 1.0965 1.0962 1.0989 1.0992 1.0979 1.0979 1.0867 1.0969
irintensity: 0.0308 0.0186 2.0473 0.0133 0.2413 0.0953 0.1577 0.1000 10.2764 0.1109 0.0406 0.0073 1.7375 0.0661 0.3183 0.7664 0.0354 0.2072 1.9865 1.1979 0.2278 0.2408 0.0889 1.7610 29.2256 5.9967 3.8021 0.1127 8.0650 0.2773 3.8146 4.6208 5.5853 2.4985 0.0996 11.4254 2.3647 1.0542 0.3727 1.1893 4.7771 3.3355 1.2838 0.6924 3.1914 0.5503 0.3315 2.8025 0.1104 3.3918 3.2621 1.4569 1.7929 12.4946 17.6594 0.8707 1.8528 13.4881 10.0758 3.4872 17.9778 2.5698 9.1457 24.6747 1.5583 15.1514 28.4466 0.7029 3.4155 22.9853 30.4221 15.5525 24.2088 77.8598 0.3308 68.5913 34.0588 40.4592 52.1761 19.4106 21.5097 59.6463 46.9268 10.1469 41.0135 14.0030 38.8844
temp: 298.150 k
press: 1.00000 atm
elementType: 6 6 6 6 6 6 6 6 6 6 6 6 6 1 1 1 1 1 1 1 1 1 1 1 1 1 1 1 1 1 1
symmnumber: 1
zpe: 714346.4 jmol-1
zpe.correction: 0.272080 hartree
zpe.thermalcorrener: 0.284932 hartree
zpe.thermalcorrenthalpy: 0.285876 hartree
zpe.thermalcorrgfe: 0.234003 hartree
zpe.sumelectzpe: -505.221021 hartree
zpe.sumelectthermal: -505.208170 hartree
zpe.sumelectthermalent: -505.207225 hartree
zpe.sumelectthermalfe: -505.259098 hartree
dipole: 0.7216 -0.2757 -0.0590
dipole: 0.7747
quadrupole: -77.2709 -74.2342 -82.2048
quadrupole: 0.6048 -0.2066 0.2003
quadrupole: 0.6324 3.6691 -4.3015 0.6048 -0.2066 0.2003
hfenergy: -505.4931011 hartree
pointgroup: C01 [X(C13H18)]
dipole: -0.2898252 -0.0915456 0.0228412 debye
polarizability: 164.5088494|-2.7282236|157.6810669|0.8858068|-1.0096518|85.453929 unknown
InChI: InChI=1S/C13H18/c1-9-4-7-12-10(2)5-6-11(3)13(12)8-9/h5-6,9H,4,7-8H2,1-3H3
charge 0 multiplicity 1
31 atoms
C  -2.489015 -0.086794 0.344832
C  -2.111672 -1.376912 -0.414131
C  -1.491372 1.029889 -0.040191
C  -0.711042 -1.865614 0.005709
C  -0.022095 0.609385 -0.01718
C  0.349441 -0.765354 0.006364
C  -3.943921 0.346755 0.073555
C  0.984981 1.62329 -0.036219
C  1.72916 -1.13504 0.043759
C  2.344978 1.241364 -0.011469
C  2.712231 -0.120365 0.035717
C  0.616703 3.097503 -0.08147
C  2.152041 -2.594548 0.089704
H  -2.378113 -0.291803 1.431548
H  -2.128835 -1.168391 -1.503995
H  -2.859312 -2.171552 -0.224031
H  -1.640426 1.899648 0.630066
H  -1.749437 1.395091 -1.059569
H  -0.389052 -2.69105 -0.658652
H  -0.771917 -2.310523 1.022796
H  -4.107506 0.514933 -1.008837
H  -4.660965 -0.426672 0.406571
H  -4.190811 1.287682 0.601044
H  3.121584 2.015655 -0.025702
H  3.77279 -0.398676 0.062592
H  0.089801 3.419411 0.838438
H  1.518681 3.72468 -0.184989
H  -0.055726 3.328749 -0.929469
H  3.246858 -2.682877 0.195585
H  1.686114 -3.133269 0.936897
H  1.860453 -3.137994 -0.830676
