program: Gaussian 09
title: 000141536
version: EM64L-G09RevD.01
frameworkgroup: C1[X(C3H9PS2)]
method: RPBEPBE
basis: SDD
operation: Freq
keyword: #pfreq=noraman
keyword: PBEPBE/SDD
title: #p freq=noraman PBEPBE/SDD
converged: YES YES NO NO
title: Mulliken charges:
elementType: S S P C C C H H H H H H H H H
charge: -0.039062 -0.053136 0.258803 -0.918403 -0.838147 -0.833975 0.287565 0.267389 0.269538 0.263160 0.267497 0.273944 0.262105 0.266344 0.266376
chargesum: 0.00000
title: Mulliken charges with hydrogens summed into heavy atoms:
elementType: S S P C C C
charge: -0.039062 -0.053136 0.258803 -0.093910 -0.033546 -0.039150
polarizability: 1.22873171e+02 2.88891087e+00 1.00507599e+02 -1.53726032e+00 4.10845756e-01 6.79906877e+01
1716.lowfreq: -20.9632 -12.8699 0.0034 0.0035 0.0041 0.2196 17.0342 40.7622 56.5853
frequency: 0.2862 40.6453 56.3767 112.7576 135.9162 152.0771 167.8979 180.3912 208.3473 251.3937 380.3121 397.7517 644.8653 649.5451 659.9613 922.1623 929.1103 964.9601 971.3810 976.8575 982.3795 1331.1280 1338.8833 1341.3453 1435.8785 1445.3442 1445.5841 1447.7960 1456.8044 1463.4270 3003.7923 3004.8493 3013.3695 3118.8253 3125.1538 3129.3043 3131.9164 3132.9816 3139.0648
redmass: 1.1688 3.4077 2.6107 4.1936 1.7468 1.3288 1.2775 3.1300 3.9376 4.6916 13.1005 12.0113 6.8815 6.9482 7.2212 1.2438 1.2355 1.1718 1.2354 1.1791 1.2415 1.1479 1.1257 1.1265 1.0499 1.0506 1.0533 1.0518 1.0544 1.0546 1.0309 1.0282 1.0283 1.1012 1.1053 1.1023 1.1030 1.1038 1.1061
irintensity: 0.2927 2.8739 2.4926 2.7424 1.8746 0.7969 0.3626 1.2350 0.1224 1.0775 42.9926 11.9355 8.3591 4.7294 0.3047 30.7571 15.4569 9.9108 1.8194 10.8271 1.1754 15.3315 3.8513 3.9999 13.9074 20.0321 12.4292 20.5196 11.6983 20.7126 11.6490 23.8522 31.7046 4.2033 12.5554 3.9289 4.2965 8.5242 17.3703
temp: 298.150 k
press: 1.00000 atm
elementType: 16 16 15 6 6 6 1 1 1 1 1 1 1 1 1
symmnumber: 1
zpe: 300805.9 jmol-1
zpe.correction: 0.114571 hartree
zpe.thermalcorrener: 0.125647 hartree
zpe.thermalcorrenthalpy: 0.126591 hartree
zpe.thermalcorrgfe: 0.071420 hartree
zpe.sumelectzpe: -1256.572801 hartree
zpe.sumelectthermal: -1256.561725 hartree
zpe.sumelectthermalent: -1256.560781 hartree
zpe.sumelectthermalfe: -1256.615952 hartree
dipole: -0.9948 -0.5885 1.5427
dipole: 1.9277
quadrupole: -60.6071 -52.9147 -64.1879
quadrupole: -0.1575 -2.0707 -0.6324
quadrupole: -1.3705 6.3218 -4.9513 -0.1575 -2.0707 -0.6324
hfenergy: -1256.6873722 hartree
pointgroup: C01 [X(C3H9P1S2)]
dipole: -0.3771082 0.269648 -0.6002367 debye
dipolederiv: -0.6377238 -0.0478559 0.0662903 -0.0123626 -0.2306179 0.0121797 -0.1972074 -0.0583584 -0.1957353 -0.4181171 0.107378 0.0549951 0.232289 -0.3442803 -0.0230077 0.3040458 -0.216618 -0.2453863 0.9116276 -0.0857813 -0.1339446 -0.1085201 0.4524537 0.0513302 -0.1232615 0.0407509 0.2626238 -0.1857303 -0.0206591 0.0099812 -0.0433162 -0.2339004 0.0589824 0.0220323 0.152021 -0.1485582 -0.0209689 0.0022566 -0.0108296 0.1011972 0.1229546 -0.054842 -0.0757981 -0.0227949 0.0683517 0.0880168 -0.0629964 0.0586051 -0.0652283 0.0637709 -0.0568088 0.1501288 -0.0739798 0.0300107 0.1220143 0.001297 -0.0327159 -0.0226106 0.072814 -0.0129705 -0.0298278 0.0349956 -0.052237 0.0482348 0.1023322 0.0498207 0.0759 -0.0128871 -0.0375978 0.0520294 -0.0278316 0.0858501 -0.0471739 -0.0841916 -0.0219639 -0.0700479 0.055093 0.0077857 -0.0123195 0.012152 0.1094707 0.1249223 0.0140629 -0.0462551 -0.0433808 0.0050643 0.0454724 0.0323553 0.059024 -0.1196824 -0.0554195 -0.0789545 -0.0441795 -0.0928009 0.0468978 0.0153111 -0.0378164 0.0111367 0.1180968 0.0651958 0.1169582 0.0626456 0.0200844 -0.0468668 -0.0143002 0.0678018 -0.0105343 0.0470832 -0.0027526 -0.0537271 0.0588294 -0.0253996 0.0449649 0.0782324 0.0115744 0.134142 -0.0186616 0.0405504 0.110643 0.0255183 0.118588 -0.0103129 -0.0468027 0.0051557 -0.0452015 0.0531794 -0.0326758 -0.0207619 -0.0967971 -0.0643917 0.0148521 -0.0229641 -0.1688927 0.0110963 0.0055945 unknown
polarizability: 119.6742626|-8.4108748|103.3277705|-2.8811096|-2.5553857|68.369424 unknown
InChI: InChI=1S/CH3P.2CH3S/c3*1-2/h3*1H3
charge 0 multiplicity 1
15 atoms
S  1.892517 -0.641913 0.231002
S  -1.4788 0.40256 0.972983
P  -0.28567 -0.955282 -0.498459
C  -0.510232 -2.598659 0.435737
C  2.11683 1.134243 -0.361083
C  -2.38912 1.467439 -0.301008
H  -0.301458 -2.483781 1.510836
H  0.175071 -3.349021 0.00591
H  -1.551994 -2.931718 0.300242
H  2.012362 1.196653 -1.454945
H  3.136277 1.427206 -0.065604
H  1.381803 1.781517 0.143078
H  -1.676069 1.934046 -0.996905
H  -2.904066 2.249659 0.27915
H  -3.12575 0.865951 -0.852934
