program: Gaussian 09
title: 000141530
version: EM64L-G09RevD.01
frameworkgroup: C1[X(C10H19NO)]
method: RPBEPBE
basis: SDD
operation: Freq
keyword: #p
keyword: freq=noraman
keyword: PBEPBE/SDD
title: #p freq=noraman PBEPBE/SDD
converged: YES YES NO NO
title: Mulliken charges:
elementType: O N C C C C C C C C C C H H H H H H H H H H H H H H H H H H H
charge: -0.458357 -0.637397 -0.006311 0.004240 -0.536689 -0.543883 -0.462720 -0.459200 -0.104616 -0.100545 -0.402442 -0.401428 0.225901 0.208887 0.193311 0.234049 0.195669 0.231350 0.192005 0.193624 0.190649 0.193678 0.222502 0.186126 0.191698 0.195202 0.191411 0.195341 0.262487 0.271905 0.333556
chargesum: 0.00000
title: Mulliken charges with hydrogens summed into heavy atoms:
elementType: O N C C C C C C C C C C
charge: -0.124801 -0.103005 0.219590 0.213127 -0.109330 -0.116864 -0.077091 -0.074874 0.117885 0.085581 -0.015543 -0.014677
polarizability: 1.23558547e+02 3.25781591e-01 1.10855984e+02 -1.71723450e+00 -1.23731763e+00 9.88500693e+01
1716.lowfreq: -17.6555 -6.1850 -0.0007 -0.0005 0.0005 14.2547 84.6041 93.9734 167.7269
frequency: 84.3772 93.9059 167.7092 180.1092 209.4665 225.3129 273.3244 298.1242 303.1523 319.9955 329.4340 408.8778 414.5759 423.2885 451.1058 476.1029 523.9659 565.1485 634.4608 743.5974 753.0804 811.0090 822.2351 833.4702 847.8101 882.1153 908.3370 923.3681 951.9867 975.3155 986.9883 1025.1860 1051.6600 1054.8248 1064.6552 1070.4303 1098.3610 1111.3244 1127.9735 1140.1497 1151.1101 1153.1676 1200.6696 1219.8010 1225.1192 1251.9527 1262.1530 1268.7172 1281.6889 1296.4519 1311.9212 1326.1224 1328.3865 1336.0156 1338.2419 1341.5503 1352.4942 1358.4519 1361.8269 1386.8105 1394.9054 1444.8299 1452.8634 1458.3332 1460.2760 1463.4774 1469.7865 1635.7763 2899.6121 2921.5149 2933.9714 2946.7076 2951.0166 2957.7799 2960.3455 2962.2120 2962.9008 2964.9077 3009.0136 3011.4674 3022.3441 3026.6310 3032.5389 3036.9072 3441.0060 3567.1008 3568.0729
redmass: 3.0701 3.5551 3.4750 2.1791 1.2371 2.6967 1.1231 1.9988 2.6644 2.0837 2.0985 2.5022 3.0628 3.2830 3.9567 2.2940 1.6968 3.0088 1.5736 2.3533 2.9676 1.5873 3.0468 1.8582 2.3624 1.8579 2.4516 1.7155 1.9114 2.0879 1.8941 2.5153 1.5415 1.3301 2.1135 1.5576 1.7542 2.2578 2.0518 2.0432 1.2536 1.3593 1.4332 1.2833 1.3425 1.2079 1.4116 1.3205 1.2339 1.2938 1.3500 1.4287 1.4377 1.3737 1.5367 1.5347 1.4563 1.6017 1.6035 1.5235 1.7310 1.0991 1.0914 1.0902 1.0935 1.0820 1.0967 1.0976 1.0817 1.0825 1.0800 1.0666 1.0608 1.0658 1.0715 1.0667 1.0666 1.0667 1.0984 1.0991 1.0971 1.0968 1.1008 1.0992 1.0451 1.0903 1.0722
irintensity: 0.3398 0.3107 3.2424 0.8730 17.4809 13.6660 153.2660 8.3846 20.6188 0.6282 1.9050 1.0745 2.2708 7.0682 2.5380 0.5600 0.9865 28.4575 137.8430 0.1819 3.2126 2.1787 4.9194 2.0781 4.1420 8.1584 15.0749 6.3429 18.6539 8.5637 36.2694 5.3982 10.1018 0.5745 13.5293 3.4662 11.1241 0.0544 5.4157 15.6977 8.6296 14.9665 4.3688 5.4721 1.3532 0.1610 4.9458 0.4779 10.3596 3.1557 1.7930 8.1906 5.9538 2.5216 1.6234 2.0129 1.2062 1.0886 3.6726 2.3609 7.0321 8.5073 4.4411 9.0171 2.2903 26.1172 3.5310 60.9642 66.8353 99.5245 4.3960 22.4585 0.8712 112.6508 73.4070 37.7450 50.0994 18.6429 81.5408 8.8824 69.6772 15.8844 22.5049 147.0746 2.1646 0.3560 2.5783
temp: 298.150 k
press: 1.00000 atm
elementType: 8 7 6 6 6 6 6 6 6 6 6 6 1 1 1 1 1 1 1 1 1 1 1 1 1 1 1 1 1 1 1
symmnumber: 1
zpe: 731368.5 jmol-1
zpe.correction: 0.278564 hartree
zpe.thermalcorrener: 0.290460 hartree
zpe.thermalcorrenthalpy: 0.291405 hartree
zpe.thermalcorrgfe: 0.241921 hartree
zpe.sumelectzpe: -521.458413 hartree
zpe.sumelectthermal: -521.446516 hartree
zpe.sumelectthermalent: -521.445572 hartree
zpe.sumelectthermalfe: -521.495055 hartree
dipole: -0.4967 -0.1952 1.0013
dipole: 1.1347
quadrupole: -73.3855 -67.2774 -78.2472
quadrupole: -0.6445 -5.1046 1.6557
quadrupole: -0.4155 5.6927 -5.2772 -0.6445 -5.1046 1.6557
hfenergy: -521.7369764 hartree
pointgroup: C01 [X(C10H19N1O1)]
dipole: 0.1941224 -0.0860629 -0.3926862 debye
polarizability: 123.5464854|-0.319459|110.9085465|-1.814133|0.9260346|98.8095683 unknown
InChI: InChI=1S/C10H19NO/c11-9-5-7-3-1-2-4-8(7)6-10(9)12/h7-10,12H,1-6,11H2
charge 0 multiplicity 1
31 atoms
O  2.271891 -1.233093 1.378335
N  2.294117 1.282928 -1.341963
C  -0.445859 0.771341 -0.014317
C  -0.455673 -0.782152 0.014701
C  0.834988 1.303663 0.669948
C  0.821733 -1.330245 -0.661581
C  -1.725217 1.342073 0.642368
C  -1.738416 -1.341333 -0.645006
C  2.137501 0.761172 0.037092
C  2.114916 -0.785737 -0.025515
C  -3.008536 0.7809 -0.014549
C  -3.017013 -0.766832 0.00937
H  -0.428088 1.081812 -1.081511
H  -0.450494 -1.093484 1.083432
H  0.850412 2.414057 0.645481
H  0.830096 1.003544 1.735658
H  0.829458 -2.441246 -0.631817
H  0.823962 -1.030858 -1.728267
H  -1.717296 2.449459 0.581424
H  -1.723705 1.08356 1.722952
H  -1.741967 -2.448946 -0.584476
H  -1.731609 -1.081659 -1.725133
H  2.986726 1.038029 0.705582
H  2.992289 -1.135994 -0.616684
H  -3.060364 1.127322 -1.067788
H  -3.907016 1.17704 0.498113
H  -3.075128 -1.112919 1.062408
H  -3.918361 -1.153469 -0.505528
H  3.188684 1.03535 -1.779467
H  2.106282 2.288227 -1.41719
H  2.176688 -2.218309 1.403029
